4,7-Methano-1H-indene,octahydro-2-methyl-,(2α,3aβ,4α,7α,7aβ)-
- Formula: C11H18
- Molecular weight: 150.2606
- IUPAC Standard InChIKey: YRZNTCJZTVDNNI-UHFFFAOYSA-N
- CAS Registry Number: 50745-90-9
- Chemical structure:
View 3d structure (requires JavaScript / HTML 5) - Other names: 4,7-Methano-1H-indene,octahydro-2-methyl,(2α,3aβ,4α,7αalpha.,7aβ)-; 4,7-Methano-1H-indene,octahydro-2-methyl-,(2α,3aβ,4α,7α,7aβ)-

Gas phase ion energetics data

Data compiled by: Sharon G. Lias, Rhoda D. Levin, and Sherif A. Kafafi
Ionization energy determinations
IE (eV) | Method | Reference |
---|---|---|
9.35 ± 0.05 | PI | Fedorova, Denisov, et al., 1973 |
Appearance energy determinations
Ion | AE (eV) | Other Products | Method | Reference | Comment |
---|---|---|---|---|---|
C5H7+ | >10.2 ± 0.1 | ? | PI | Fedorova, Denisov, et al., 1973 | |
C6H10+ | 10.0 ± 0.1 | ? | PI | Fedorova, Denisov, et al., 1973 | |
C7H11+ | 10.0 ± 0.1 | ? | PI | Fedorova, Denisov, et al., 1973 | |
C8H13+ | 10.1 ± 0.1 | ? | PI | Fedorova, Denisov, et al., 1973 | |
C9H13+ | 10.1 ± 0.1 | ? | PI | Fedorova, Denisov, et al., 1973 | |
C10H15+ | 10.1 ± 0.1 | CH3 | PI | Fedorova, Denisov, et al., 1973 |

References

Fedorova, Denisov, et al., 1973
Fedorova, M.S.; Denisov, Y.V.; Poptapov, V.K.,
Mass-spectrometric study of the photoionisation processes of tricyclo[5,2,1,02,6] decane and its alkyl derivatives,
Russ. J. Phys. Chem., 1973, 47, 1498. [all data]