Methane, tetraiodo-
- Formula: CI4
- Molecular weight: 519.6286
- IUPAC Standard InChIKey: JOHCVVJGGSABQY-UHFFFAOYSA-N
- CAS Registry Number: 507-25-5
- Chemical structure:
View 3d structure (requires JavaScript / HTML 5) - Other names: Carbon tetraiodide; Carbon iodide (CI4); Tetraiodomethane; CI4; Carbon iodide

Gas phase thermochemistry data

Data compiled by: Hussein Y. Afeefy, Joel F. Liebman, and Stephen E. Stein
Quantity | Value | Units | Method | Reference | Comment |
---|---|---|---|---|---|
ΔfH°gas | 267.94 | kJ/mol | Cm | Kudchadker and Kudchadker, 1976 |

Condensed phase thermochemistry data

Data compiled as indicated in comments:
ALS - Hussein Y. Afeefy, Joel F. Liebman, and Stephen E. Stein
DH - Eugene S. Domalski and Elizabeth D. Hearing
Quantity | Value | Units | Method | Reference | Comment |
---|---|---|---|---|---|
ΔfH°solid | 392.2 ± 8.2 | kJ/mol | Ccr | Carson, Laye, et al., 1993 | ALS |
Quantity | Value | Units | Method | Reference | Comment |
ΔcH°solid | -786.4 ± 8.0 | kJ/mol | Ccr | Carson, Laye, et al., 1993 | ALS |
Constant pressure heat capacity of solid
Cp,solid (J/mol*K) | Temperature (K) | Reference | Comment |
---|---|---|---|
259.8 | 298.15 | Carson, Laye, et al., 1993 | DH |

Gas phase ion energetics data

Data compiled as indicated in comments:
LBLHLM - Sharon G. Lias, John E. Bartmess, Joel F. Liebman, John L. Holmes, Rhoda D. Levin, and W. Gary Mallard
LLK - Sharon G. Lias, Rhoda D. Levin, and Sherif A. Kafafi
Ionization energy determinations
IE (eV) | Method | Reference | Comment |
---|---|---|---|
8.95 | PE | Jonkers, De Lange, et al., 1982 | LBLHLM |
9.10 | PE | Jonkers, De Lange, et al., 1982 | Vertical value; LBLHLM |
Appearance energy determinations
Ion | AE (eV) | Other Products | Method | Reference | Comment |
---|---|---|---|---|---|
I2+ | 11.3 ± 0.1 | ? | EI | DeCorpo and Franklin, 1971 | LLK |

Vibrational and/or electronic energy levels

Data compiled by: Takehiko Shimanouchi
Symmetry: Td Symmetry Number σ = 12
Sym. | No | Approximate | Selected Freq. | Infrared | Raman | Comments | ||||
---|---|---|---|---|---|---|---|---|---|---|
Species | type of mode | Value | Rating | Value | Phase | Value | Phase | |||
a1 | 1 | Sym str | 178 | D | ia | 178 | sln. | |||
e | 2 | Deg deform | 90 | D | ia | 90 | sln. | |||
f2 | 3 | Deg str | 555 | D | 555 VS | sln. | ||||
f2 | 4 | Deg deform | 125 | E | 123 W | sln. | 123 | sln. | Crystal field splitting | |
f2 | 4 | Deg deform | 125 | E | 127 W | sln. | 123 | sln. | Crystal field splitting | |
Source: Shimanouchi, 1972

Normal alkane RI, non-polar column, custom temperature program

Column type | Active phase | I | Reference | Comment |
---|---|---|---|---|
Capillary | OV-1, SE-30, Methyl silicone, SP-2100, OV-101, DB-1, etc. | 1862. | Waggott and Davies, 1984 | Hydrogen; Column length: 50. m; Column diameter: 0.32 mm; Program: not specified |

References

Kudchadker and Kudchadker, 1976
Kudchadker, S.A.; Kudchadker, A.P.,
Erratum: Ideal gas thermodynamic properties of eight bromo- and iodomethanes,
J. Phys. Chem. Ref. Data, 1976, 5, 529-530. [all data]
Carson, Laye, et al., 1993
Carson, A.S.; Laye, P.G.; Pedley, J.B.; Welsby, A.M.,
The enthalpies of formation iodomethane, diiodomethane, triiodomethane, and tetraiodomethane by rotating combustion calorimetry,
J. Chem. Thermodyn., 1993, 25, 261-269. [all data]
Jonkers, De Lange, et al., 1982
Jonkers, G.; De Lange, C.A.; Snijders, J.G.,
Effects of relativity in the He(I) photoelectron spectrum of CI4,
Chem. Phys., 1982, 69, 109. [all data]
DeCorpo and Franklin, 1971
DeCorpo, J.J.; Franklin, J.L.,
Electron affinities of the halogen molecules by dissociative electron attachment,
J. Chem. Phys., 1971, 54, 1885. [all data]
Shimanouchi, 1972
Shimanouchi, T.,
Tables of Molecular Vibrational Frequencies Consolidated Volume I, National Bureau of Standards, 1972, 1-160. [all data]
Waggott and Davies, 1984
Waggott, A.; Davies, I.W.,
Identification of organic pollutants using linear temperature programmed retention indices (LTPRIs) - Part II, 1984, retrieved from http://dwi.defra.gov.uk/research/completed-research/reports/dwi0383.pdf. [all data]