Thioacetic acid
- Formula: C2H4OS
- Molecular weight: 76.118
- IUPAC Standard InChIKey: DUYAAUVXQSMXQP-UHFFFAOYSA-N
- CAS Registry Number: 507-09-5
- Chemical structure:

Reaction thermochemistry data

Data compiled by: Hussein Y. Afeefy, Joel F. Liebman, and Stephen E. Stein
Individual Reactions
By formula: C4H6O2S = C2H2O + C2H4OS
Quantity | Value | Units | Method | Reference | Comment |
---|---|---|---|---|---|
ΔrH° | 22.6 | kcal/mol | Eqk | Blake and Speis, 1974 | gas phase; Heat of formation derived by 77PED/RYL |
By formula: C2H4OS + H2O = C2H4O2 + H2S
Quantity | Value | Units | Method | Reference | Comment |
---|---|---|---|---|---|
ΔrH° | -0.64 ± 0.07 | kcal/mol | Cm | Sunner and Wadso, 1957 | liquid phase; Heat of hydrolysis |
By formula: C2H4OS + C3H6O = C5H10O2S
Quantity | Value | Units | Method | Reference | Comment |
---|---|---|---|---|---|
ΔrH° | -6.5 ± 0.2 | kcal/mol | Eqk | Horii, Kawamura, et al., 1972 | liquid phase; solvent: CD3COCD3; NMR |
By formula: C2H2O + C2H4OS = C4H6O2S
Quantity | Value | Units | Method | Reference | Comment |
---|---|---|---|---|---|
ΔrH° | -22.6 | kcal/mol | Eqk | Blake and Speis, 1974 | gas phase |

Gas phase ion energetics data

Data compiled as indicated in comments:
LLK - Sharon G. Lias, Rhoda D. Levin, and Sherif A. Kafafi
Ionization energy determinations
IE (eV) | Method | Reference | Comment |
---|---|---|---|
10.06 | PE | Nagata, Yamabe, et al., 1975 | Vertical value; LLK |

Condensed phase thermochemistry data

Data compiled by: Hussein Y. Afeefy, Joel F. Liebman, and Stephen E. Stein

Quantity Value Units Method Reference Comment
Δfliquid-219.3 ± 1.5kJ/molCcrSunner, 1963Correction of Sunner, 1955
Δfliquid-216.5 ± 0.59kJ/molCmSunner and Wadso, 1957Reanalyzed by Cox and Pilcher, 1970, Original value = -215. ± 2. kJ/mol; Heat of hydrolysis
Quantity Value Units Method Reference Comment
Δcliquid-1741.5kJ/molCcrSunner, 1963Correction of Sunner, 1955

Phase change data

Data compiled by: William E. Acree, Jr., James S. Chickos

Enthalpy of vaporization

ΔvapH (kJ/mol) Temperature (K) Reference Comment
35.2333.Dykyj, Svoboda, et al., 1999Based on data from 307. - 360. K.

Van Den Dool and Kratz RI, polar column, custom temperature program

View large format table.

Column type Active phase I Reference Comment
CapillaryDB-FFAP1124.Huynh-Ba, Matthey-Doret, et al., 200330. m/0.32 mm/0.25 μm; Program: 35C(2min) => 6C/min => 180C => 10C/min => 240C (10min)

References

Blake and Speis, 1974
Blake, P.G.; Speis, A.,
Reactions of keten. Part IV. Kinetics and thermodynamics of the gas-phase reaction: Thioacetic acid + keten = acetic Thioanhydride,
J. Chem. Soc. Perkin Trans. 2, 1974, 1879-1881. [all data]
Sunner and Wadso, 1957
Sunner, S.; Wadso, I.,
The heat of hydrolysis of thiolacetic acid,
Trans. Faraday Soc., 1957, 53, 455-459. [all data]
Horii, Kawamura, et al., 1972
Horii, T.; Kawamura, S.; Tsurugi, J.,
A NMR study of the thioacetic acid-acetone mixture,
Bull. Chem. Soc. Jpn., 1972, 45, 2200-2202. [all data]
Nagata, Yamabe, et al., 1975
Nagata, S.; Yamabe, T.; Fukui, K.,
A study of the electronic spectra of thioacetic acid and its ethyl ester,
J. Phys. Chem., 1975, 79, 2335. [all data]