Fulminic acid
- Formula: CHNO
- Molecular weight: 43.0247
- IUPAC Standard InChIKey: UXKUODQYLDZXDL-UHFFFAOYSA-N
- CAS Registry Number: 506-85-4
- Chemical structure:
View 3d structure (requires JavaScript / HTML 5) - Permanent link for this species. Use this link for bookmarking this species for future reference.

Gas phase ion energetics data

Data evaluated as indicated in comments:
HL - Edward P. Hunter and Sharon G. Lias
Data compiled as indicated in comments:
LLK - Sharon G. Lias, Rhoda D. Levin, and Sherif A. Kafafi
Quantity | Value | Units | Method | Reference | Comment |
---|---|---|---|---|---|
Proton affinity (review) | 758. | kJ/mol | N/A | Hunter and Lias, 1998 | HL |
Quantity | Value | Units | Method | Reference | Comment |
Gas basicity | 725.5 | kJ/mol | N/A | Hunter and Lias, 1998 | HL |
Ionization energy determinations
IE (eV) | Method | Reference | Comment |
---|---|---|---|
10.83 | PE | Bastide and Maier, 1976 | LLK |

References

Hunter and Lias, 1998
Hunter, E.P.; Lias, S.G.,
Evaluated Gas Phase Basicities and Proton Affinities of Molecules: An Update,
J. Phys. Chem. Ref. Data, 1998, 27, 3, 413-656, https://doi.org/10.1063/1.556018
. [all data]
Bastide and Maier, 1976
Bastide, J.; Maier, J.P.,
Electronic states of the radical cations of the 1,3-dipoles: HCNO, CH2N2, and N3H, studied by photoelectron spectroscopy,
Chem. Phys., 1976, 12, 177. [all data]