Mercury, bromomethyl-
- Formula: CH3BrHg
- Molecular weight: 295.53
- IUPAC Standard InChIKey: ZDHHIJSLJCLMPX-UHFFFAOYSA-M
- CAS Registry Number: 506-83-2
- Chemical structure:
View 3d structure (requires JavaScript / HTML 5) - Other names: Methylmercuric bromide; Bromomercuriomethane; Bromomethylmercury; Methylmercury bromide; CH3HgBr

Gas phase thermochemistry data

Data compiled by: José A. Martinho Simões
Quantity | Value | Units | Method | Reference | Comment |
---|---|---|---|---|---|
ΔfH°gas | -18.6 ± 2.9 | kJ/mol | Review | Martinho Simões | The enthalpy of formation relies on 57.8 ± 3.0 kJ/mol for the enthalpy of formation of Hg(Me)2(l). |

Condensed phase thermochemistry data

Data compiled by: José A. Martinho Simões
Quantity | Value | Units | Method | Reference | Comment |
---|---|---|---|---|---|
ΔfH°solid | -86.4 ± 2.4 | kJ/mol | Review | Martinho Simões | The enthalpy of formation relies on 57.8 ± 3.0 kJ/mol for the enthalpy of formation of Hg(Me)2(l). |

Phase change data

Data compiled as indicated in comments:
MS - José A. Martinho Simões
AC - William E. Acree, Jr., James S. Chickos
Quantity | Value | Units | Method | Reference | Comment |
---|---|---|---|---|---|
ΔsubH° | 67.8 ± 1.7 | kJ/mol | RSC | Charnley and Skinner, 1951 | MS |
Enthalpy of sublimation
ΔsubH (kJ/mol) | Temperature (K) | Method | Reference | Comment |
---|---|---|---|---|
67.6 ± 1.6 | 277.5 | V | Stephenson and Malanowski, 1987 | Based on data from 258. to 297. K. See also Charnley and Skinner, 1951, 2.; AC |

Reaction thermochemistry data

Data compiled by: José A. Martinho Simões
Individual Reactions
By formula: C2H6Hg (l) + Br2Hg (cr) = 2CH3BrHg (cr)
Quantity | Value | Units | Method | Reference | Comment |
---|---|---|---|---|---|
ΔrH° | -61.0 ± 3.1 | kJ/mol | RSC | Hartley, Pritchard, et al., 1950 | Please also see Pedley and Rylance, 1977 and Cox and Pilcher, 1970. |

Gas phase ion energetics data

Data compiled as indicated in comments:
LLK - Sharon G. Lias, Rhoda D. Levin, and Sherif A. Kafafi
RDSH - Henry M. Rosenstock, Keith Draxl, Bruce W. Steiner, and John T. Herron
Ionization energy determinations
IE (eV) | Method | Reference | Comment |
---|---|---|---|
10.6 ± 0.2 | EI | Glockling, Irwin, et al., 1976 | LLK |
10.16 | PE | Eland, 1970 | Vertical value; RDSH |
Appearance energy determinations
Ion | AE (eV) | Other Products | Method | Reference | Comment |
---|---|---|---|---|---|
BrHg+ | 12.8 ± 0.2 | CH3 | EI | Glockling, Irwin, et al., 1976 | LLK |

References

Martinho Simões
Martinho Simões, J.A.,
Private communication (see http://webbook.nist.gov/chemistry/om/). [all data]
Charnley and Skinner, 1951
Charnley, T.; Skinner, H.A.,
J. Chem. Soc., 1951, 1921.. [all data]
Stephenson and Malanowski, 1987
Stephenson, Richard M.; Malanowski, Stanislaw,
Handbook of the Thermodynamics of Organic Compounds, 1987, https://doi.org/10.1007/978-94-009-3173-2
. [all data]
Charnley and Skinner, 1951, 2
Charnley, T.; Skinner, H.A.,
424. Measurements of the vapour pressures of some alkylmercury halides. The latent heats of sublimation of methyl- and ethyl- mercury halides,
J. Chem. Soc., 1951, 1921, https://doi.org/10.1039/jr9510001921
. [all data]
Hartley, Pritchard, et al., 1950
Hartley, K.; Pritchard, H.O.; Skinner, H.A.,
Thermochemistry of metallic alkyls. III.?mercury dimethyl and mercury methyl halides,
Trans. Faraday Soc., 1950, 46, 1019, https://doi.org/10.1039/tf9504601019
. [all data]
Pedley and Rylance, 1977
Pedley, J.B.; Rylance, J.,
Computer Analysed Thermochemical Data: Organic and Organometallic Compounds, University of Sussex, Brigton, 1977. [all data]
Cox and Pilcher, 1970
Cox, J.D.; Pilcher, G.,
Thermochemistry of Organic and Organometallic Compounds
in Academic Press, New York, 1970. [all data]
Glockling, Irwin, et al., 1976
Glockling, F.; Irwin, J.G.; Morrison, R.J.; Sweeney, J.J.,
A mass spectroscopic study of organomercurials and mercuric halides,
Inorg. Chim. Acta, 1976, 19, 267. [all data]
Eland, 1970
Eland, J.H.D.,
Photoelectron spectra and chemical bonding of mercury(II) compounds,
Intern. J. Mass Spectrom. Ion Phys., 1970, 4, 37. [all data]