Borane, aminodifluoro
- Formula: BF2H2N
- Molecular weight: 64.830
- IUPAC Standard InChIKey: MRPRWRRSOOXCIM-UHFFFAOYSA-N
- CAS Registry Number: 50673-31-9
- Chemical structure:
View 3d structure (requires JavaScript / HTML 5) - Permanent link for this species. Use this link for bookmarking this species for future reference.

Gas phase ion energetics data

Data compiled as indicated in comments:
LBLHLM - Sharon G. Lias, John E. Bartmess, Joel F. Liebman, John L. Holmes, Rhoda D. Levin, and W. Gary Mallard
LLK - Sharon G. Lias, Rhoda D. Levin, and Sherif A. Kafafi
Ionization energy determinations
IE (eV) | Method | Reference | Comment |
---|---|---|---|
10.9 | PE | Kroto and McNaughton, 1985 | LBLHLM |
12.4 ± 0.4 | EI | Rothgery, McGee, et al., 1975 | LLK |
11.47 | PE | Kroto and McNaughton, 1985 | Vertical value; LBLHLM |
Appearance energy determinations
Ion | AE (eV) | Other Products | Method | Reference | Comment |
---|---|---|---|---|---|
HBNF+ | 14.0 ± 0.2 | HF | EI | Rothgery, McGee, et al., 1975 | LLK |
H2BNF+ | 16.1 ± 0.4 | F | EI | Rothgery, McGee, et al., 1975 | LLK |
BF2+ | 16.1 ± 0.3 | ? | EI | Rothgery, McGee, et al., 1975 | LLK |

References

Kroto and McNaughton, 1985
Kroto, H.W.; McNaughton, D.,
Photoelectron spectra of the aminodifluoroboranes NH2BF2, NHMeBF2, and NMe2BF2,
J. Chem. Soc. Dalton Trans., 1985, 1767. [all data]
Rothgery, McGee, et al., 1975
Rothgery, E.F.; McGee, H.A., Jr.; Pusatcioglu, S.,
Aminodifluoroborane,
Inorg. Chem., 1975, 14, 2236. [all data]