Cyanogen bromide
- Formula: CBrN
- Molecular weight: 105.921
- IUPAC Standard InChIKey: ATDGTVJJHBUTRL-UHFFFAOYSA-N
- CAS Registry Number: 506-68-3
- Chemical structure:
View 3d structure (requires JavaScript / HTML 5) - Other names: Bromine cyanide; Bromocyan; Bromocyanide; Bromocyanogen; Campilit; Cyanobromide; Cyanogen monobromide; BrCN; (CN)Br; Bromine cyanide (BrCN); Bromocyanide (BrCN); Bromure de cyanogen; Cyanogen bromide (BrCN); TL 822; Cyanogen bromide ((CN)Br); Rcra waste number U246; UN 1889; Bromine monocyanide; NSC 89684

Gas phase thermochemistry data

Data compiled as indicated in comments:
ALS - Hussein Y. Afeefy, Joel F. Liebman, and Stephen E. Stein
Quantity | Value | Units | Method | Reference | Comment |
---|---|---|---|---|---|
ΔfH°gas | 186.19 | kJ/mol | Review | Chase, 1998 | Data last reviewed in June, 1969 |
ΔfH°gas | 185.6 ± 6.0 | kJ/mol | Cm | Lord and Woolf, 1954 | Reanalyzed by Cox and Pilcher, 1970, Original value = 181. kJ/mol; Heat of hydrolysis; ALS |
Quantity | Value | Units | Method | Reference | Comment |
S°gas,1 bar | 248.35 | J/mol*K | Review | Chase, 1998 | Data last reviewed in June, 1969 |
Gas Phase Heat Capacity (Shomate Equation)
Cp° = A + B*t + C*t2 + D*t3 +
E/t2
H° − H°298.15= A*t + B*t2/2 +
C*t3/3 + D*t4/4 − E/t + F − H
S° = A*ln(t) + B*t + C*t2/2 + D*t3/3 −
E/(2*t2) + G
Cp = heat capacity (J/mol*K)
H° = standard enthalpy (kJ/mol)
S° = standard entropy (J/mol*K)
t = temperature (K) / 1000.
View plot Requires a JavaScript / HTML 5 canvas capable browser.
Temperature (K) | 298. to 1300. | 1300. to 6000. |
---|---|---|
A | 46.46248 | 60.31152 |
B | 15.50076 | 2.211040 |
C | -2.870656 | -0.200183 |
D | -0.631956 | 0.013172 |
E | -0.327555 | -4.574618 |
F | 170.5700 | 158.1088 |
G | 298.2485 | 307.9006 |
H | 186.1880 | 186.1880 |
Reference | Chase, 1998 | Chase, 1998 |
Comment | Data last reviewed in June, 1969 | Data last reviewed in June, 1969 |

Condensed phase thermochemistry data

Data compiled by: Hussein Y. Afeefy, Joel F. Liebman, and Stephen E. Stein
Quantity | Value | Units | Method | Reference | Comment |
---|---|---|---|---|---|
ΔfH°solid | 140.4 ± 4.3 | kJ/mol | Cm | Lord and Woolf, 1954 | Reanalyzed by Pedley, Naylor, et al., 1986, Original value = 136. kJ/mol; Heat of hydrolysis |

Phase change data

Data compiled as indicated in comments:
ALS - Hussein Y. Afeefy, Joel F. Liebman, and Stephen E. Stein
AC - William E. Acree, Jr., James S. Chickos
Quantity | Value | Units | Method | Reference | Comment |
---|---|---|---|---|---|
ΔsubH° | 45.23 | kJ/mol | V | Lord and Woolf, 1954 | Heat of hydrolysis; ALS |
Antoine Equation Parameters
log10(P) = A − (B / (T + C))
P = vapor pressure (bar)
T = temperature (K)
View plot Requires a JavaScript / HTML 5 canvas capable browser.
Temperature (K) | A | B | C | Reference | Comment |
---|---|---|---|---|---|
273.01 to 313.09 | 3.53667 | 727.385 | -130.052 | Lord and Woolf, 1954 | Coefficents calculated by NIST from author's data. |
Enthalpy of sublimation
ΔsubH (kJ/mol) | Temperature (K) | Method | Reference | Comment |
---|---|---|---|---|
45.2 ± 4.2 | 273. to 308. | MM | Lord and Woolf, 1954, 2 | See also Cox and Pilcher, 1970, 2.; AC |
45.9 | 288. | N/A | Lord and Woolf, 1954, 2 | Based on data from 273. to 313. K. See also Boublik, Fried, et al., 1984.; AC |
47.0 | 256. to 308. | GS | Baxter, Bezzenberger, et al., 1920 | AC |

Reaction thermochemistry data

Data compiled by: Hussein Y. Afeefy, Joel F. Liebman, and Stephen E. Stein
Individual Reactions
2 +
=
+
+ CNO.Na
By formula: 2HNaO + CBrN = BrNa + H2O + CNO.Na
Quantity | Value | Units | Method | Reference | Comment |
---|---|---|---|---|---|
ΔrH° | -234.6 ± 0.71 | kJ/mol | Cm | Lord and Woolf, 1954 | solid phase; Heat of hydrolysis |

Gas phase ion energetics data

Data evaluated as indicated in comments:
HL - Edward P. Hunter and Sharon G. Lias
Data compiled as indicated in comments:
LL - Sharon G. Lias and Joel F. Liebman
RDSH - Henry M. Rosenstock, Keith Draxl, Bruce W. Steiner, and John T. Herron
Quantity | Value | Units | Method | Reference | Comment |
---|---|---|---|---|---|
Proton affinity (review) | 749.8 | kJ/mol | N/A | Hunter and Lias, 1998 | HL |
Quantity | Value | Units | Method | Reference | Comment |
Gas basicity | 719.2 | kJ/mol | N/A | Hunter and Lias, 1998 | HL |
Ionization energy determinations
IE (eV) | Method | Reference | Comment |
---|---|---|---|
12. ± 1. | EI | Ibuki, Hiraya, et al., 1996 | LL |
11.88 | PE | Lake and Thompson, 1970 | RDSH |
11.85 ± 0.02 | PE | Heilbronner, Hornung, et al., 1970 | RDSH |
11.84 ± 0.01 | PI | Dibeler and Liston, 1967 | RDSH |
Appearance energy determinations
Ion | AE (eV) | Other Products | Method | Reference | Comment |
---|---|---|---|---|---|
Br+ | 45. ± 2. | C+(N+) | PIPECO | Ibuki, Hiraya, et al., 1996 | LL |
Br+ | 16. ± 1. | CN | EI | Ibuki, Hiraya, et al., 1996 | LL |
Br+ | 15.52 ± 0.02 | CN | PI | Dibeler and Liston, 1967 | RDSH |
Br+ | 11.9 ± 0.2 | CN- | EI | Herron and Dibeler, 1960 | RDSH |
C+ | 25. ± 1. | Br+N | EI | Ibuki, Hiraya, et al., 1996 | LL |
CBr+ | 21. ± 1. | N | EI | Ibuki, Hiraya, et al., 1996 | LL |
CBr+ | 17.4 ± 0.2 | N | EI | Herron and Dibeler, 1960 | RDSH |
CN+ | 19. ± 1. | Br | EI | Ibuki, Hiraya, et al., 1996 | LL |
CN+ | 14.6 ± 0.1 | Br- | EI | Herron and Dibeler, 1960 | RDSH |
CN+ | 18.3 ± 0.1 | Br | EI | Herron and Dibeler, 1960 | RDSH |
N+ | 28. ± 2. | Br+C | EI | Ibuki, Hiraya, et al., 1996 | LL |

Normal alkane RI, non-polar column, custom temperature program

Column type | Active phase | I | Reference | Comment |
---|---|---|---|---|
Capillary | SPB-1 | 482. | Flanagan, Streete, et al., 1997 | 60. m/0.53 mm/5. μm, He; Program: 40C(6min) => 5C/min => 80C => 10C/min => 200C |
Capillary | SPB-1 | 482. | Strete, Ruprah, et al., 1992 | 60. m/0.53 mm/5.0 μm, Helium; Program: 40 0C (6 min) 5 0C/min -> 80 0C 10 0C/min -> 200 0C |

References

Chase, 1998
Chase, M.W., Jr.,
NIST-JANAF Themochemical Tables, Fourth Edition,
J. Phys. Chem. Ref. Data, Monograph 9, 1998, 1-1951. [all data]
Lord and Woolf, 1954
Lord, G.; Woolf, A.A.,
The cyanogen halides. Part III. Their heats of formation and free energies,
J. Chem. Soc., 1954, 2546-2551. [all data]
Cox and Pilcher, 1970
Cox, J.D.; Pilcher, G.,
Thermochemistry of Organic and Organometallic Compounds, Academic Press, New York, 1970, 1-636. [all data]
Pedley, Naylor, et al., 1986
Pedley, J.B.; Naylor, R.D.; Kirby, S.P.,
Thermochemical Data of Organic Compounds, Chapman and Hall, New York, 1986, 1-792. [all data]
Lord and Woolf, 1954, 2
Lord, G.; Woolf, A.A.,
The cyanogen halides. Part III. Their heats of formation and free energies,
J. Chem. Soc., 1954, 2546, https://doi.org/10.1039/jr9540002546
. [all data]
Cox and Pilcher, 1970, 2
Cox, J.D.; Pilcher, G.,
Thermochemistry of Organic and Organometallic Compounds, Academic Press Inc., London, 1970, 643. [all data]
Boublik, Fried, et al., 1984
Boublik, T.; Fried, V.; Hala, E.,
The Vapour Pressures of Pure Substances: Selected Values of the Temperature Dependence of the Vapour Pressures of Some Pure Substances in the Normal and Low Pressure Region, 2nd ed., Elsevier, New York, 1984, 972. [all data]
Baxter, Bezzenberger, et al., 1920
Baxter, G.P.; Bezzenberger, F.K.; Wilson, C.H.,
THE VAPOR PRESSURES OF CERTAIN SUBSTANCES: CHLORO-PICRIN, CYANOGEN BROMIDE, METHYL-DICHLORO-ARSINE, PHENYL-DICHLORO-ARSINE, DIPHENYL-CHLORO-ARSINE AND ARSENIC TRICHLORIDE. 1,
J. Am. Chem. Soc., 1920, 42, 7, 1386-1393, https://doi.org/10.1021/ja01452a012
. [all data]
Hunter and Lias, 1998
Hunter, E.P.; Lias, S.G.,
Evaluated Gas Phase Basicities and Proton Affinities of Molecules: An Update,
J. Phys. Chem. Ref. Data, 1998, 27, 3, 413-656, https://doi.org/10.1063/1.556018
. [all data]
Ibuki, Hiraya, et al., 1996
Ibuki, T.; Hiraya, A.; Olney, T.N.; Brion, C.E.,
Ionic photofragmentation (11.5-160 eV) and PIPICO spectroscopy (40-130 eV) of BrCN in the valence shell and bromine 3d regions,
Chem. Phys., 1996, 203, 359. [all data]
Lake and Thompson, 1970
Lake, R.F.; Thompson, H.,
The photoelectron spectra of some molecules containing the C N group,
Proc. Roy. Soc. (London), 1970, A317, 187. [all data]
Heilbronner, Hornung, et al., 1970
Heilbronner, E.; Hornung, V.; Muszkat, K.A.,
Die Photoelektron-Spektren von Chlor-, Brom- und Jodcyan,
Helv. Chim. Acta, 1970, 53, 347. [all data]
Dibeler and Liston, 1967
Dibeler, V.H.; Liston, S.K.,
Mass-spectrometric study of photoionization. VIII.Dicyanogen and the cyanogen halides,
J. Chem. Phys., 1967, 47, 4548. [all data]
Herron and Dibeler, 1960
Herron, J.T.; Dibeler, V.H.,
Electron impact study of the cyanogen halides,
J. Am. Chem. Soc., 1960, 82, 1555. [all data]
Flanagan, Streete, et al., 1997
Flanagan, R.J.; Streete, P.J.; Ramsey, J.D.,
Volatile Substance Abuse, UNODC Technical Series, No 5, United Nations, Office on Drugs and Crime, Vienna International Centre, PO Box 500, A-1400 Vienna, Austria, 1997, 56, retrieved from http://www.odccp.org/pdf/technicalseries1997-01-011.pdf. [all data]
Strete, Ruprah, et al., 1992
Strete, P.J.; Ruprah, M.; Ramsey, J.D.; Flanagan, R.J.,
Detection and identification of volatile substances by headspace capillary gas chromatography to aid the diagnosis of acute poisoning,
Analyst, 1992, 117, 7, 1111-1127, https://doi.org/10.1039/an9921701111
. [all data]