Dimethylgermanone

Gas phase ion energetics data

Data compiled by: Sharon G. Lias, John E. Bartmess, Joel F. Liebman, John L. Holmes, Rhoda D. Levin, and W. Gary Mallard

Ionization energy determinations

IE (eV) Method Reference Comment
9.7PEPfister-Guillouzo and Guimon, 1985Vertical value
9.7PEGuimon, Pfister-Guillouzo, et al., 1985Vertical value

References

Pfister-Guillouzo and Guimon, 1985
Pfister-Guillouzo, G.; Guimon, C., Studies by P.E.S. of highly reactive sulfur species, Phosphorus Sulfur, 1985, 23, 197. [all data]

Guimon, Pfister-Guillouzo, et al., 1985
Guimon, G.; Pfister-Guillouzo, G.; Rima, G.; El Amine, M.; Barrau, J., Generation, detection and electronic structure of dimethyl germanone by photoelectron spectroscopy and quantum calculations, Spectrosc. Lett., 1985, 18, 7. [all data]