Cyclohexanone, 2,2-dimethyl-6,6-diphenyl-
- Formula: C20H22O
- Molecular weight: 278.3881
- IUPAC Standard InChIKey: LKGJEIWVWSCBGA-UHFFFAOYSA-N
- CAS Registry Number: 50592-53-5
- Chemical structure:
View 3d structure (requires JavaScript / HTML 5) - Permanent link for this species. Use this link for bookmarking this species for future reference.

Gas phase ion energetics data

Data compiled by: Sharon G. Lias, Rhoda D. Levin, and Sherif A. Kafafi
Appearance energy determinations
Ion | AE (eV) | Other Products | Method | Reference | Comment |
---|---|---|---|---|---|
C9H7+ | 13.8 ± 0.4 | ? | EI | Fortin and Rousseau, 1973 | |
C13H9+ | 13.4 ± 0.4 | ? | EI | Fortin and Rousseau, 1973 | |
C14H12+ | 9.9 ± 0.4 | ? | EI | Fortin and Rousseau, 1973 | |
C15H13+ | 10.3 ± 0.4 | ? | EI | Fortin and Rousseau, 1973 | |
C16H14+ | 9.4 ± 0.4 | ? | EI | Fortin and Rousseau, 1973 |

References

Fortin and Rousseau, 1973
Fortin, C.J.; Rousseau, Y.,
Spectrometrie de masse des cyclohexanones gem-diphenylees. II. Chaleurs de formation et structures possibles des principaux ions fragmentaires,
Can. J. Chem., 1973, 51, 3457. [all data]