Cyclohexanone, 6-[(butylthio)methylene]-2,2-diphenyl-
- Formula: C23H26OS
- Molecular weight: 350.517
- IUPAC Standard InChIKey: DJPZTHCPTYZSHM-HNENSFHCSA-N
- CAS Registry Number: 50592-51-3
- Chemical structure:
View 3d structure (requires JavaScript / HTML 5) - Permanent link for this species. Use this link for bookmarking this species for future reference.

Gas phase ion energetics data

Data compiled by: Sharon G. Lias, Rhoda D. Levin, and Sherif A. Kafafi
Appearance energy determinations
Ion | AE (eV) | Other Products | Method | Reference | Comment |
---|---|---|---|---|---|
C9H7+ | 13.7 ± 0.4 | ? | EI | Fortin and Rousseau, 1973 | |
C13H9+ | 13.7 ± 0.4 | ? | EI | Fortin and Rousseau, 1973 | |
C14H12+ | 10.1 ± 0.4 | ? | EI | Fortin and Rousseau, 1973 | |
C15H13+ | 10.8 ± 0.4 | ? | EI | Fortin and Rousseau, 1973 |

References

Fortin and Rousseau, 1973
Fortin, C.J.; Rousseau, Y.,
Spectrometrie de masse des cyclohexanones gem-diphenylees. II. Chaleurs de formation et structures possibles des principaux ions fragmentaires,
Can. J. Chem., 1973, 51, 3457. [all data]