Cyclohexanone,2-methyl-5,5-diphenyl-
- Formula: C19H20O
- Molecular weight: 264.3615
- IUPAC Standard InChIKey: IEEGJJCOUZRVOF-UHFFFAOYSA-N
- CAS Registry Number: 50592-49-9
- Chemical structure:
View 3d structure (requires JavaScript / HTML 5) - Permanent link for this species. Use this link for bookmarking this species for future reference.

Gas phase ion energetics data

Data compiled by: Sharon G. Lias, Rhoda D. Levin, and Sherif A. Kafafi
Ionization energy determinations
IE (eV) | Method | Reference |
---|---|---|
8.8 ± 0.2 | EI | Fortin, Forest, et al., 1973 |
Appearance energy determinations
Ion | AE (eV) | Other Products | Method | Reference | Comment |
---|---|---|---|---|---|
C9H7+ | 13.5 ± 0.4 | ? | EI | Fortin and Rousseau, 1973 | |
C13H9+ | 14.0 ± 0.4 | ? | EI | Fortin and Rousseau, 1973 | |
C14H10+ | 9.6 ± 0.4 | ? | EI | Fortin and Rousseau, 1973 | |
C14H12+ | 10.0 ± 0.4 | ? | EI | Fortin and Rousseau, 1973 | |
C15H13+ | 10.8 ± 0.4 | ? | EI | Fortin and Rousseau, 1973 |

References

Fortin, Forest, et al., 1973
Fortin, C.J.; Forest, M.; Vaziri, C.; Gravel, D.; Rousseau, Y.,
Spectrometrie de masse des cyclohexanones gem-diphenylees. I. Localisation de la charge positive,
Can. J. Chem., 1973, 51, 3445. [all data]
Fortin and Rousseau, 1973
Fortin, C.J.; Rousseau, Y.,
Spectrometrie de masse des cyclohexanones gem-diphenylees. II. Chaleurs de formation et structures possibles des principaux ions fragmentaires,
Can. J. Chem., 1973, 51, 3457. [all data]