Cyclohexene,1-methyl-4,4-diphenyl-
- Formula: C19H20
- Molecular weight: 248.3621
- IUPAC Standard InChIKey: CXOXZFHYVCGWNQ-UHFFFAOYSA-N
- CAS Registry Number: 50592-48-8
- Chemical structure:
View 3d structure (requires JavaScript / HTML 5) - Permanent link for this species. Use this link for bookmarking this species for future reference.

Gas phase ion energetics data

Data compiled by: Sharon G. Lias, Rhoda D. Levin, and Sherif A. Kafafi
Ionization energy determinations
IE (eV) | Method | Reference |
---|---|---|
8.7 ± 0.4 | EI | Fortin and Rousseau, 1973 |
Appearance energy determinations
Ion | AE (eV) | Other Products | Method | Reference | Comment |
---|---|---|---|---|---|
C13H9+ | 13.4 ± 0.4 | ? | EI | Fortin and Rousseau, 1973 | |
C14H12+ | 9.8 ± 0.4 | ? | EI | Fortin and Rousseau, 1973 |

References

Fortin and Rousseau, 1973
Fortin, C.J.; Rousseau, Y.,
Spectrometrie de masse des cyclohexanones gem-diphenylees. II. Chaleurs de formation et structures possibles des principaux ions fragmentaires,
Can. J. Chem., 1973, 51, 3457. [all data]