1,3-Dioxepane
- Formula: C5H10O2
- Molecular weight: 102.1317
- IUPAC Standard InChIKey: CZLMRJZAHXYRIX-UHFFFAOYSA-N
- CAS Registry Number: 505-65-7
- Chemical structure:
View 3d structure (requires JavaScript / HTML 5) - Permanent link for this species. Use this link for bookmarking this species for future reference.

Gas phase thermochemistry data

Data compiled by: Glushko Thermocenter, Russian Academy of Sciences, Moscow
Quantity | Value | Units | Method | Reference | Comment |
---|---|---|---|---|---|
S°gas | 338.6 ± 4.8 | J/mol*K | N/A | Clegg G.A., 1970 |
Constant pressure heat capacity of gas
Cp,gas (J/mol*K) | Temperature (K) | Reference | Comment |
---|---|---|---|
35.56 | 50. | Dorofeeva O.V., 1992 | p=1 bar. |
48.38 | 100. | ||
63.02 | 150. | ||
78.27 | 200. | ||
104.00 | 273.15 | ||
113.6 ± 3.5 | 298.15 | ||
114.34 | 300. | ||
153.46 | 400. | ||
188.95 | 500. | ||
218.92 | 600. | ||
243.89 | 700. | ||
264.81 | 800. | ||
282.46 | 900. | ||
297.43 | 1000. | ||
310.18 | 1100. | ||
321.08 | 1200. | ||
330.42 | 1300. | ||
338.46 | 1400. | ||
345.41 | 1500. |

Condensed phase thermochemistry data

Data compiled as indicated in comments:
ALS - Hussein Y. Afeefy, Joel F. Liebman, and Stephen E. Stein
DH - Eugene S. Domalski and Elizabeth D. Hearing
Quantity | Value | Units | Method | Reference | Comment |
---|---|---|---|---|---|
ΔcH°liquid | -3009. | kJ/mol | Ccb | Skuratov, Strepikheev, et al., 1957 | Combustion of liq at 293 K; Corresponding ΔfHºliquid = -387. kJ/mol (simple calculation by NIST; no Washburn corrections); ALS |
Constant pressure heat capacity of liquid
Cp,liquid (J/mol*K) | Temperature (K) | Reference | Comment |
---|---|---|---|
167. | 298. | Conti, Gianni, et al., 1976 | DH |

Phase change data

Data compiled by: Hussein Y. Afeefy, Joel F. Liebman, and Stephen E. Stein
Enthalpy of vaporization
ΔvapH (kJ/mol) | Temperature (K) | Method | Reference | Comment |
---|---|---|---|---|
41. | 293. | V | Skuratov, Strepikheev, et al., 1957 | Combustion of liq at 293 K |

Gas phase ion energetics data

Data compiled as indicated in comments:
RDSH - Henry M. Rosenstock, Keith Draxl, Bruce W. Steiner, and John T. Herron
Ionization energy determinations
IE (eV) | Method | Reference | Comment |
---|---|---|---|
9.45 | EI | Collin and Conde-Caprace, 1966 | RDSH |
Appearance energy determinations
Ion | AE (eV) | Other Products | Method | Reference | Comment |
---|---|---|---|---|---|
C3H6+ | 12.28 | ? | EI | Collin and Conde-Caprace, 1966 | RDSH |
C3H6O2+ | 10.0 | C2H4 | EI | Collin and Conde-Caprace, 1966 | RDSH |
C3H7+ | 12.36 | ? | EI | Collin and Conde-Caprace, 1966 | RDSH |
C4H7O+ | 10.55 | CH3O | EI | Collin and Conde-Caprace, 1966 | RDSH |
C4H8O+ | 10.21 | CH2O | EI | Collin and Conde-Caprace, 1966 | RDSH |
C5H9O2+ | 10.04 | H | EI | Collin and Conde-Caprace, 1966 | RDSH |

Kovats' RI, non-polar column, isothermal

Column type | Active phase | Temperature (C) | I | Reference | Comment |
---|---|---|---|---|---|
Packed | Apiezon L | 120. | 795. | Bogoslovsky, Anvaer, et al., 1978 | Celite 545 |
Packed | Apiezon L | 160. | 827. | Bogoslovsky, Anvaer, et al., 1978 | Celite 545 |

Normal alkane RI, non-polar column, isothermal

Column type | Active phase | Temperature (C) | I | Reference | Comment |
---|---|---|---|---|---|
Packed | Apieson L | 120. | 802. | Kurdina, Markovich, et al., 1969 | not specified, not specified |

Normal alkane RI, non-polar column, custom temperature program

Column type | Active phase | I | Reference | Comment |
---|---|---|---|---|
Capillary | SE-30 | 829. | Vinogradov, 2004 | Program: not specified |

Normal alkane RI, polar column, custom temperature program

Column type | Active phase | I | Reference | Comment |
---|---|---|---|---|
Capillary | Carbowax 20M | 1176. | Vinogradov, 2004 | Program: not specified |

References

Clegg G.A., 1970
Clegg G.A.,
Thermodynamics of polymerization of heterocyclic compounds. Part 6. The heat capacity, entropy, enthalpy and free energy of 1,3-dioxepan and poly-1,3-dioxepan,
Polymer, 1970, 11, 245-252. [all data]
Dorofeeva O.V., 1992
Dorofeeva O.V.,
Ideal gas thermodynamic properties of oxygen heterocyclic compounds. Part 2. Six-membered, seven-membered and eight-membered rings,
Thermochim. Acta, 1992, 200, 121-150. [all data]
Skuratov, Strepikheev, et al., 1957
Skuratov, S.M.; Strepikheev, A.A.; Shtekhter, S.M.; Volokhina, A.V.,
About the enthalpies of polymerization of cyclic formales,
Dokl. Akad. Nauk SSSR, 1957, 117, 263-265. [all data]
Conti, Gianni, et al., 1976
Conti, G.; Gianni, P.; Matteoli, E.; Mengheri, M.,
Capacita termiche molari di alcuni composti organici mono- e bifunzionali nel liquido puro e in soluzione acquosa a 25C,
Chim. Ind. (Milan), 1976, 58, 225. [all data]
Collin and Conde-Caprace, 1966
Collin, J.E.; Conde-Caprace, G.,
Ionization and dissociation of cyclic ethers by electron impact,
Intern. J. Mass Spectrom. Ion Phys., 1966, 1, 213. [all data]
Bogoslovsky, Anvaer, et al., 1978
Bogoslovsky, Yu.N.; Anvaer, B.I.; Vigdergauz, M.S.,
Chromatographic constants in gas chromatography (in Russian), Standards Publ. House, Moscow, 1978, 192. [all data]
Kurdina, Markovich, et al., 1969
Kurdina, Z.G.; Markovich, V.E.; Sakharov, V.M.,
Gas chromatography of cyclic O-containing compounds
in Gas chromatography, Issue # 10, NIITEKhim, Moscow, 1969, 128-133. [all data]
Vinogradov, 2004
Vinogradov, B.A.,
Production, composition, properties and application of essential oils, 2004, retrieved from http://viness.narod.ru. [all data]