1,2-Dioxepane
- Formula: C5H10O2
- Molecular weight: 102.1317
- IUPAC Standard InChIKey: HGGNZMUHOHGHBJ-UHFFFAOYSA-N
- CAS Registry Number: 505-63-5
- Chemical structure:
View 3d structure (requires JavaScript / HTML 5) - Permanent link for this species. Use this link for bookmarking this species for future reference.

Gas phase ion energetics data

Data compiled as indicated in comments:
LLK - Sharon G. Lias, Rhoda D. Levin, and Sherif A. Kafafi
Ionization energy determinations
IE (eV) | Method | Reference | Comment |
---|---|---|---|
9.75 | PE | Coughlin, Brown, et al., 1979 | Vertical value; LLK |

References

Coughlin, Brown, et al., 1979
Coughlin, D.J.; Brown, R.S.; Salomon, R.G.,
The prostaglandin endoperoxide nucleus and related bicyclic peroxides. Synthetic and spectroscopic studies,
J. Am. Chem. Soc., 1979, 101, 1533. [all data]