Thiirane,cis-2,3-diethynyl-
- Formula: C6H4S
- Molecular weight: 108.161
- IUPAC Standard InChIKey: ZEODDVBXGCQFTC-OLQVQODUSA-N
- CAS Registry Number: 50555-56-1
- Chemical structure:
View 3d structure (requires JavaScript / HTML 5) - Stereoisomers:

Gas phase ion energetics data

Data compiled by: Sharon G. Lias, Rhoda D. Levin, and Sherif A. Kafafi
Ionization energy determinations
IE (eV) | Method | Reference |
---|---|---|
8.80 | PE | Brogli, Heilbronner, et al., 1975 |

References

Brogli, Heilbronner, et al., 1975
Brogli, F.; Heilbronner, E.; Wirz, J.; Kloster-Jensen, E.; Bergman, R.G.; Vollhardt, K.P.C.; Ashe, A.J., III,
The consequences of σ and π conjugative interactions in mono-, di- and triacetylenes. A photoelectron spectroscopic investigation,
Helv. Chim. Acta, 1975, 58, 2620. [all data]