Thiacyclohexane, 4-methylene
- Formula: C6H10S
- Molecular weight: 114.209
- IUPAC Standard InChIKey: BOJWREQWHOWAEL-UHFFFAOYSA-N
- CAS Registry Number: 50550-56-6
- Chemical structure:
View 3d structure (requires JavaScript / HTML 5) - Other names: Thiocyclohexane, 4-methylene

Gas phase ion energetics data

Data compiled as indicated in comments:
LLK - Sharon G. Lias, Rhoda D. Levin, and Sherif A. Kafafi
Ionization energy determinations
IE (eV) | Method | Reference | Comment |
---|---|---|---|
9.22 | PE | Sarneel, Worrell, et al., 1980 | LLK |

Kovats' RI, non-polar column, custom temperature program

Column type | Active phase | I | Reference | Comment |
---|---|---|---|---|
Packed | Squalane | 920. | Stopp, Engewald, et al., 1975 | N2, Chromosorb W (60-80 mesh); Column length: 3. m; Program: not specified |

Kovats' RI, polar column, custom temperature program

Column type | Active phase | I | Reference | Comment |
---|---|---|---|---|
Packed | Carbowax 20M | 1203. | Stopp, Engewald, et al., 1975 | N2, Chromosorn W (80-100 mesh); Column length: 3. m; Program: not specified |

References

Sarneel, Worrell, et al., 1980
Sarneel, R.; Worrell, C.W.; Pasman, P.; Verhoeven, J.W.; Mes, G.F.,
The photoelectron spectra of 4-methylene thiacyclohexane derivatives through-bond interaction,
Tetrahedron, 1980, 36, 3241. [all data]
Stopp, Engewald, et al., 1975
Stopp, V.I.; Engewald, W.; Remane, H.; Borsdorf, R.,
Gas chromatographisches retentionsverhalten von exo/endo-doppelbindungsisomeren sechsringverbindungen,
J. Prakt. Chem., 1975, 317, 3, 420-424, https://doi.org/10.1002/prac.19753170309
. [all data]