Chlorpromazine
- Formula: C17H19ClN2S
- Molecular weight: 318.864
- IUPAC Standard InChIKey: ZPEIMTDSQAKGNT-UHFFFAOYSA-N
- CAS Registry Number: 50-53-3
- Chemical structure:
View 3d structure (requires JavaScript / HTML 5) - Other names: 10H-Phenothiazine-10-propanamine, 2-chloro-N,N-dimethyl-; Phenothiazine, 2-chloro-10-[3-(dimethylamino)propyl]-; Aminazin; Aminazine; Ampliactil; Amplictil; Chlor-Promanyl; Chlorderazin; Chlorpromados; Contomin; CPZ; Elmarin; Esmind; Fenactil; Fenaktyl; Fraction AB; HL 5746; Largactil; Largactilothiazine; Largactyl; Megaphen; Novomazina; Phenactyl; Plegomasine; Proma; Promactil; Promazil; Propaphenin; Prozil; Sanopron; SKF 2601-A; Thorazine; Torazina; Wintermin; 2-Chloro-10-[3-(Dimethylamino)propyl]phenothiazine; 2-Chloropromazine; 4560 R.P.; Aminasine; Amplicitil; Chloropromazine; Chlorpromazin; Psychozine; 2-Cloro-10 (3-dimetilaminopropil)fenotiazina; Clorpromazina; 2601-A; RP-4560; BC 135

Phase change data

Data compiled by: Robert L. Brown and Stephen E. Stein
Reduced pressure boiling point
Tboil (K) | Pressure (atm) | Reference |
---|---|---|
475.7 | 0.001 | Weast and Grasselli, 1989 |

Gas phase ion energetics data

Data compiled as indicated in comments:
LLK - Sharon G. Lias, Rhoda D. Levin, and Sherif A. Kafafi
RDSH - Henry M. Rosenstock, Keith Draxl, Bruce W. Steiner, and John T. Herron
Ionization energy determinations
IE (eV) | Method | Reference | Comment |
---|---|---|---|
8.25 ± 0.07 | CTS | Poltorakov, Pirnazarova, et al., 1973 | LLK |
7.38 ± 0.13 | CTS | Fulton and Lyons, 1968 | RDSH |
7.16 ± 0.08 | PE | Domelsmith, Munchausen, et al., 1977 | Vertical value; LLK |

Kovats' RI, non-polar column, isothermal

View large format table.

Column type Active phase Temperature (C) I Reference Comment
PackedSE-30240.2479.Musumarra, Scarlata, et al., 1987N2, 1% se-30 on Anachrom ABS(80-100mesh); Column length: 2. m
CapillarySPB-1250.2526.Lora-Tamayo, Rams, et al., 1986He; Column length: 25. m; Column diameter: 0.20 mm
PackedOV-1250.2525.Berninger and Möller, 1977

Kovats' RI, non-polar column, temperature ramp

View large format table.

Column type Active phase I Reference Comment
CapillarySE-302499.Schepers, Wijsbeek, et al., 198225. m/0.49 mm/1.14 μm, 100. C @ 2. min, 8. K/min, 275. C @ 15. min

Kovats' RI, non-polar column, custom temperature program

View large format table.

Column type Active phase I Reference Comment
PackedOV-1012540.McLinden and Stenhouse, 1979N2, Chromosorb W; Column length: 2. m; Program: not specified

Van Den Dool and Kratz RI, non-polar column, temperature ramp

View large format table.

Column type Active phase I Reference Comment
CapillarySPB-12525.Christ, Noomano, et al., 198830. m/0.75 mm/1.0 μm, He, 10. K/min, 280. C @ 12. min; Tstart: 160. C
CapillaryCBP-12443.Oyama, Sano, et al., 1987N2, 6. K/min; Column length: 12. m; Column diameter: 0.53 mm; Tstart: 120. C; Tend: 250. C
CapillaryDB-12474.Perrigo, Peel, et al., 198515. m/0.32 mm/0.25 μm, He, 8. K/min, 280. C @ 5. min; Tstart: 120. C
CapillaryMethyl Silicone2481.0Newton and Foery, 198412. m/0.2 mm/0.33 μm, He, 50. C @ 1. min, 20. K/min, 300. C @ 3. min
CapillaryDB-12474.Perrigo, Ballantyne, et al., 198415. m/0.25 mm/0.25 μm, He, 8. K/min, 280. C @ 5. min; Tstart: 120. C
CapillarySE-302452.Anderson and Stafford, 198315. m/0.25 mm/0.25 μm, He, 5. K/min; Tstart: 100. C; Tend: 295. C
PackedSE-302490.Perrigo and Peel, 1981N2, Chromosorb W, 130. C @ 2. min, 8. K/min, 290. C @ 8. min; Column length: 1.8 m

Van Den Dool and Kratz RI, non-polar column, custom temperature program

View large format table.

Column type Active phase I Reference Comment
CapillaryBP-12480.Stowell and Wilson, 198712. m/0.22 mm/0.25 μm, He; Program: 120C => 8C/min => 270C => 25C/min => 300C

Normal alkane RI, non-polar column, isothermal

View large format table.

Column type Active phase Temperature (C) I Reference Comment
PackedOV-1240.2515.Courtot, 1976Supelcoport (100-120 mesh); Column length: 2. m
PackedOV-1260.2538.Courtot, 1976Supelcoport (100-120 mesh); Column length: 2. m

Normal alkane RI, non-polar column, temperature ramp

View large format table.

Column type Active phase I Reference Comment
PackedPolydimethyl siloxane2487.MHA, 9999Nitrogen; Column length: 2. m; Tstart: 100. C; Tend: 300. C
PackedSE-302486.MHA, 9999Nitrogen, Chromosorb G AW DMCS (80-100 mesh); Column length: 2. m; Tstart: 100. C; Tend: 300. C
CapillaryBP-12452.Stowell and Wilson, 198512. m/0.22 mm/0.25 μm, He, 5. K/min; Tstart: 100. C; Tend: 295. C
CapillaryBP-12474.Stowell and Wilson, 198512. m/0.22 mm/0.25 μm, He, 8. K/min; Tstart: 120. C; Tend: 280. C
CapillaryBP-12481.Stowell and Wilson, 198512. m/0.22 mm/0.25 μm, He, 20. K/min; Tstart: 50. C; Tend: 300. C
PackedOV-1012500.Maurer and Pfleger, 1984N2, Chromosorb G HP, 20. K/min, 310. C @ 3. min; Column length: 0.6 m; Tstart: 100. C
PackedOV-12480.Marozzi, Gambaro, et al., 1982Gas Chrom P, 5. K/min; Column length: 2. m; Tstart: 150. C; Tend: 300. C
PackedSE-302490.Marozzi, Gambaro, et al., 1982Gas Chrom P, 5. K/min; Column length: 2. m; Tstart: 150. C; Tend: 300. C
PackedSE-302490.Peel and Perrigo, 1976Nitrogen, Chromosorb W AW DMS (80-100 mesh), 130. C @ 2. min, 8. K/min, 290. C @ 8. min; Column length: 2. m
PackedSE-302490.Peel and Perrigo, 1975N2, Chromosorb W AW DMS, 130. C @ 2. min, 8. K/min, 290. C @ 8. min; Column length: 2. m

Normal alkane RI, non-polar column, custom temperature program

View large format table.

Column type Active phase I Reference Comment
CapillaryCP Sil 5 CB2480.Bogusz, Bialka, et al., 198610. m/0.53 mm/5.2 μm; Program: 100 0C (2 min) 20 0C/min -> 180 0C 7.5 0C/min -> 280 0C (6 min)
CapillaryCP Sil 5 CB2486.Bogusz, Bialka, et al., 198610. m/0.53 mm/5.2 μm; Program: not specified
CapillaryBP-12480.Stowell and Wilson, 198512. m/0.22 mm/0.25 μm, He; Program: 120 0X 8 0C/min -> 270 0C 25 0C/min -> 300 0C (5 min)
CapillaryBP-12440.Stowell and Wilson, 198512. m/0.22 mm/0.25 μm, He; Program: not specified
OtherMethyl Silicone2486.Ardrey and Moffat, 1981Program: not specified
PackedOV-1012440.Dubsky, Hána, et al., 1978Nitrogen, Chromosorb G (100-120 mesh); Column length: 2. m; Program: not specified

References

Weast and Grasselli, 1989
CRC Handbook of Data on Organic Compounds, 2nd Editon, Weast,R.C and Grasselli, J.G., ed(s)., CRC Press, Inc., Boca Raton, FL, 1989, 1. [all data]
Poltorakov, Pirnazarova, et al., 1973
Poltorakov, A.P.; Pirnazarova, F.N.; But, P.G.; Piruzyan, L.A.; Chibrikin, V.M.; Vikjlyaev, Yu.I.; Ul'yanova, O.V.,
Ionization potentials of phenothiazine derivatives and their correlation with the parmacologic effect,
Bull. Acad. Sci. USSR, Div. Chem. Sci., 1973, 22, 2050, In original 2106. [all data]
Fulton and Lyons, 1968
Fulton, A.; Lyons, L.E.,
The ionization energies of some phenothiazine tranquillizers and molecules of similar structure,
Australian J. Chem., 1968, 21, 873. [all data]
Domelsmith, Munchausen, et al., 1977
Domelsmith, L.N.; Munchausen, L.L.; Houk, K.N.,
Photoelectron spectra of psychotropic drugs. 2. Phenothiazine and related tranquilizers,
J. Am. Chem. Soc., 1977, 99, 6506. [all data]