Amitriptyline
- Formula: C20H23N
- Molecular weight: 277.4033
- IUPAC Standard InChIKey: KRMDCWKBEZIMAB-UHFFFAOYSA-N
- CAS Registry Number: 50-48-6
- Chemical structure:
View 3d structure (requires JavaScript / HTML 5) - Other names: 1-Propanamine, 3-(10,11-dihydro-5H-dibenzo[a,d]cyclohepten-5-ylidene)-N,N-dimethyl-; 5H-Dibenzo[a,d]cycloheptene-Δ5,γ-propylamine, 10,11-dihydro-N,N-dimethyl-; Adepress; Adepril; Amitriptylin; Damilen; Damitriptyline; Elavil; Flavyl; Lantron; Proheptadiene; Ro 4-1575; Seroten; Triptanol; Triptisol; Tryptanol; 5-(γ-Dimethylaminopropylidene)-5H-Dibenzo[a,d][1,4]cycloheptadiene; Damilan; 3-(10,11-Dihydro-5H-dibenzo(a,d)cyclohepten-5-ylidene)-N,N-dimethyl-1-propanamine; 10,11-Dihydro-5-(γ-dimethylaminopropylidene)-5H-dibenzo(a,d)cycloheptene; 10,11-Dihydro-N,N-dimethyl-5H-dibenzo(a,d)heptalene-Δ5,γ-propylamine; 5-(3'-Dimethylaminopropylidene)-dibenzo-(a,d)(1,4)-cycloheptadiene; 5-(3-Dimethylaminopropylidene)-10,11-dihydro-5H-dibenzo(a,d)cycloheptene; 5-(γ-Dimethylaminopropylidene)-5H-dibenzo(a,d)-10,11-dihydrocycloheptene; 5-(γ-Dimethylaminopropylidene)-10,11-dihydro-5H-dibenzo(a,d)cycloheptene; Elanil; 5-(γ-Dimethylaminopropylidine)-5H-dibenzo(a,d)(1,4)cycloheptadiene; Amitryptiline; Laroxyl; Lentizol; Triptizol; Vanatrip; Domical

Gas phase ion energetics data

Data compiled as indicated in comments:
LLK - Sharon G. Lias, Rhoda D. Levin, and Sherif A. Kafafi
RDSH - Henry M. Rosenstock, Keith Draxl, Bruce W. Steiner, and John T. Herron
Ionization energy determinations
IE (eV) | Method | Reference | Comment |
---|---|---|---|
8.26 ± 0.07 | CTS | Poltorakov, Pirnazarova, et al., 1973 | LLK |
8.32 ± 0.08 | CTS | Fulton and Lyons, 1968 | RDSH |

Kovats' RI, non-polar column, isothermal

View large format table.

Column type Active phase Temperature (C) I Reference Comment
CapillaryBP-1200.2182.Japp, Gill, et al., 198725. m/0.22 mm/0.25 μm, N2
CapillaryDB-1200.2194.Japp, Gill, et al., 198730. m/0.53 mm/1.5 μm, N2
CapillaryBP-1200.2188.Japp, Gill, et al., 198725. m/0.53 mm/1. μm, N2
PackedSE-30220.2201.Musumarra, Scarlata, et al., 1987N2, 1% se-30 on Anachrom ABS(80-100mesh); Column length: 2. m
CapillarySPB-1250.2236.Lora-Tamayo, Rams, et al., 1986He; Column length: 25. m; Column diameter: 0.20 mm
PackedOV-1200.2185.Berninger and Möller, 1977

Kovats' RI, non-polar column, temperature ramp

View large format table.

Column type Active phase I Reference Comment
CapillarySE-302195.Schepers, Wijsbeek, et al., 198225. m/0.49 mm/1.14 μm, 100. C @ 2. min, 8. K/min, 275. C @ 15. min

Kovats' RI, non-polar column, custom temperature program

View large format table.

Column type Active phase I Reference Comment
PackedOV-1012220.McLinden and Stenhouse, 1979N2, Chromosorb W; Column length: 2. m; Program: not specified
PackedSE-302200.Moffat, Stead, et al., 1974Column length: 2. m; Program: not specified

Kovats' RI, polar column, custom temperature program

View large format table.

Column type Active phase I Reference Comment
PackedCarbowax 20M2924.Moffat, Stead, et al., 1974Column length: 1. m; Program: not specified

Van Den Dool and Kratz RI, non-polar column, temperature ramp

View large format table.

Column type Active phase I Reference Comment
CapillaryVF-5MS2252.Tretyakov, 201430. m/0.25 mm/0.25 μm, He; Tstart: 60. C; Tend: 270. C
CapillarySPB-12194.Christ, Noomano, et al., 198830. m/0.75 mm/1.0 μm, He, 10. K/min, 280. C @ 12. min; Tstart: 160. C
CapillaryDB-12179.Perrigo, Peel, et al., 198515. m/0.32 mm/0.25 μm, He, 8. K/min, 280. C @ 5. min; Tstart: 120. C
CapillaryDB-12179.Perrigo, Ballantyne, et al., 198415. m/0.25 mm/0.25 μm, He, 8. K/min, 280. C @ 5. min; Tstart: 120. C
CapillaryDB-12187.Perrigo, Ballantyne, et al., 198415. m/0.25 mm/0.25 μm, He, 12. K/min, 280. C @ 5. min; Tstart: 120. C
CapillaryDB-12192.Perrigo, Ballantyne, et al., 198415. m/0.25 mm/0.25 μm, He, 15. K/min, 280. C @ 5. min; Tstart: 120. C
CapillaryDB-12169.Perrigo, Ballantyne, et al., 198415. m/0.25 mm/0.25 μm, He, 5. K/min, 280. C @ 5. min; Tstart: 120. C
CapillarySE-302162.Anderson and Stafford, 198315. m/0.25 mm/0.25 μm, He, 5. K/min; Tstart: 100. C; Tend: 295. C
PackedSE-302190.Perrigo and Peel, 1981N2, Chromosorb W, 130. C @ 2. min, 8. K/min, 290. C @ 8. min; Column length: 1.8 m

Van Den Dool and Kratz RI, non-polar column, custom temperature program

View large format table.

Column type Active phase I Reference Comment
CapillaryCP Sil 5 CB2208.Aderjan and Bogusz, 198810. m/0.53 mm/5.0 μm, He; Program: 100 0C (2 min ) 15 0C/min -> 200 0C 10 0C/min -> 300 0C (8 min hold)
CapillaryBP-12181.Stowell and Wilson, 198712. m/0.22 mm/0.25 μm, He; Program: 120C => 8C/min => 270C => 25C/min => 300C

Normal alkane RI, non-polar column, isothermal

View large format table.

Column type Active phase Temperature (C) I Reference Comment
PackedOV-101200.2208.Dubsky, Hána, et al., 1978Nitrogen, Chromosorb G (100-120 mesh); Column length: 2. m

Normal alkane RI, non-polar column, temperature ramp

View large format table.

Column type Active phase I Reference Comment
PackedSE-302196.MHA, 9999Nitrogen, Chromosorb G AW DMCS (80-100 mesh); Column length: 2. m; Tstart: 100. C; Tend: 300. C
CapillaryDB-52166.Phillips, Logan, et al., 199015. m/0.25 mm/0.2 μm, He, 10. K/min; Tstart: 185. C; Tend: 270. C
CapillaryBP-12191.Stowell and Wilson, 198512. m/0.22 mm/0.25 μm, He, 12. K/min; Tstart: 120. C; Tend: 270. C
CapillaryBP-12200.Stowell and Wilson, 198512. m/0.22 mm/0.25 μm, He, 15. K/min; Tstart: 120. C; Tend: 270. C
CapillaryBP-12209.Stowell and Wilson, 198512. m/0.22 mm/0.25 μm, He, 25. K/min; Tstart: 120. C; Tend: 270. C
CapillaryBP-12174.Stowell and Wilson, 198512. m/0.22 mm/0.25 μm, He, 6. K/min; Tstart: 120. C; Tend: 270. C
CapillaryBP-12181.Stowell and Wilson, 198512. m/0.22 mm/0.25 μm, He, 8. K/min; Tstart: 120. C; Tend: 270. C
CapillaryBP-12162.Stowell and Wilson, 198512. m/0.22 mm/0.25 μm, He, 5. K/min; Tstart: 100. C; Tend: 295. C
CapillaryBP-12179.Stowell and Wilson, 198512. m/0.22 mm/0.25 μm, He, 8. K/min; Tstart: 120. C; Tend: 280. C
PackedOV-12210.Marozzi, Gambaro, et al., 1982Gas Chrom P, 2.5 K/min; Column length: 2. m; Tstart: 120. C; Tend: 200. C
PackedSE-302210.Marozzi, Gambaro, et al., 1982Gas Chrom P, 2.5 K/min; Column length: 2. m; Tstart: 120. C; Tend: 200. C
PackedSE-302190.Peel and Perrigo, 1976Nitrogen, Chromosorb W AW DMS (80-100 mesh), 130. C @ 2. min, 8. K/min, 290. C @ 8. min; Column length: 2. m
PackedSE-302190.Peel and Perrigo, 1975N2, Chromosorb W AW DMS, 130. C @ 2. min, 8. K/min, 290. C @ 8. min; Column length: 2. m

Normal alkane RI, non-polar column, custom temperature program

View large format table.

Column type Active phase I Reference Comment
CapillaryBP-12181.Stowell and Wilson, 198512. m/0.22 mm/0.25 μm, He; Program: 120 0X 8 0C/min -> 270 0C 25 0C/min -> 300 0C (5 min)
CapillaryBP-12200.Stowell and Wilson, 198512. m/0.22 mm/0.25 μm, He; Program: not specified
PackedOV-1012204.Maurer and Pfleger, 1984Program: not specified
CapillaryOV-1, SE-30, Methyl silicone, SP-2100, OV-101, DB-1, etc.2162.Waggott and Davies, 1984Hydrogen; Column length: 50. m; Column diameter: 0.32 mm; Program: not specified
OtherMethyl Silicone2196.Ardrey and Moffat, 1981Program: not specified
PackedOV-1012200.Dubsky, Hána, et al., 1978Nitrogen, Chromosorb G (100-120 mesh); Column length: 2. m; Program: not specified

References

Poltorakov, Pirnazarova, et al., 1973
Poltorakov, A.P.; Pirnazarova, F.N.; But, P.G.; Piruzyan, L.A.; Chibrikin, V.M.; Vikjlyaev, Yu.I.; Ul'yanova, O.V.,
Ionization potentials of phenothiazine derivatives and their correlation with the parmacologic effect,
Bull. Acad. Sci. USSR, Div. Chem. Sci., 1973, 22, 2050, In original 2106. [all data]
Fulton and Lyons, 1968
Fulton, A.; Lyons, L.E.,
The ionization energies of some phenothiazine tranquillizers and molecules of similar structure,
Australian J. Chem., 1968, 21, 873. [all data]