Desipramine
- Formula: C18H22N2
- Molecular weight: 266.3807
- IUPAC Standard InChIKey: HCYAFALTSJYZDH-UHFFFAOYSA-N
- CAS Registry Number: 50-47-5
- Chemical structure:

Gas phase ion energetics data

Data compiled by: Henry M. Rosenstock, Keith Draxl, Bruce W. Steiner, and John T. Herron
Ionization energy determinations
IE (eV) | Method | Reference |
---|---|---|
7.39 ± 0.06 | CTS | Fulton and Lyons, 1968 |

Kovats' RI, non-polar column, isothermal

Column type | Active phase | Temperature (C) | I | Reference | Comment |
---|---|---|---|---|---|
Packed | SE-30 | 220. | 2235. | Musumarra, Scarlata, et al., 1987 | N2, 1% se-30 on Anachrom ABS(80-100mesh); Column length: 2. m |

Kovats' RI, non-polar column, temperature ramp

Column type | Active phase | I | Reference | Comment |
---|---|---|---|---|
Capillary | SE-30 | 2241. | Schepers, Wijsbeek, et al., 1982 | 25. m/0.49 mm/1.14 μm, 100. C @ 2. min, 8. K/min, 275. C @ 15. min |

Kovats' RI, non-polar column, custom temperature program

Column type | Active phase | I | Reference | Comment |
---|---|---|---|---|
Packed | OV-101 | 2220. | McLinden and Stenhouse, 1979 | N2, Chromosorb W; Column length: 2. m; Program: not specified |

Van Den Dool and Kratz RI, non-polar column, temperature ramp

Column type | Active phase | I | Reference | Comment |
---|---|---|---|---|
Capillary | SPB-1 | 2242. | Christ, Noomano, et al., 1988 | 30. m/0.75 mm/1.0 μm, He, 10. K/min, 280. C @ 12. min; Tstart: 160. C |
Capillary | DB-1 | 2217. | Perrigo, Peel, et al., 1985 | 15. m/0.32 mm/0.25 μm, He, 8. K/min, 280. C @ 5. min; Tstart: 120. C |
Capillary | DB-1 | 2217. | Perrigo, Ballantyne, et al., 1984 | 15. m/0.25 mm/0.25 μm, He, 8. K/min, 280. C @ 5. min; Tstart: 120. C |
Capillary | SE-30 | 2200. | Anderson and Stafford, 1983 | 15. m/0.25 mm/0.25 μm, He, 5. K/min; Tstart: 100. C; Tend: 295. C |
Packed | SE-30 | 2235. | Perrigo and Peel, 1981 | N2, Chromosorb W, 130. C @ 2. min, 8. K/min, 290. C @ 8. min; Column length: 1.8 m |

Normal alkane RI, non-polar column, temperature ramp

Column type | Active phase | I | Reference | Comment |
---|---|---|---|---|
Packed | SE-30 | 2242. | MHA, 9999 | Nitrogen, Chromosorb G AW DMCS (80-100 mesh); Column length: 2. m; Tstart: 100. C; Tend: 300. C |
Capillary | DB-5 | 2204. | Phillips, Logan, et al., 1990 | 15. m/0.25 mm/0.2 μm, He, 10. K/min; Tstart: 185. C; Tend: 270. C |
Packed | SE-30 | 2255. | Marozzi, Gambaro, et al., 1982 | Gas Chrom P, 5. K/min; Column length: 2. m; Tstart: 150. C; Tend: 300. C |
Packed | SE-30 | 2236. | Peel and Perrigo, 1976 | Nitrogen, Chromosorb W AW DMS (80-100 mesh), 130. C @ 2. min, 8. K/min, 290. C @ 8. min; Column length: 2. m |
Packed | SE-30 | 2236. | Peel and Perrigo, 1975 | N2, Chromosorb W AW DMS, 130. C @ 2. min, 8. K/min, 290. C @ 8. min; Column length: 2. m |

Normal alkane RI, non-polar column, custom temperature program

Column type | Active phase | I | Reference | Comment |
---|---|---|---|---|
Capillary | OV-1, SE-30, Methyl silicone, SP-2100, OV-101, DB-1, etc. | 2200. | Waggott and Davies, 1984 | Hydrogen; Column length: 50. m; Column diameter: 0.32 mm; Program: not specified |
Other | Methyl Silicone | 2242. | Ardrey and Moffat, 1981 | Program: not specified |

References

Fulton and Lyons, 1968
Fulton, A.; Lyons, L.E.,
The ionization energies of some phenothiazine tranquillizers and molecules of similar structure,
Australian J. Chem., 1968, 21, 873. [all data]
Musumarra, Scarlata, et al., 1987
Musumarra, G.; Scarlata, G.; Romano, G.; Cappello, G.; Clementi, S.; Giulietti, G.,
Qualitative organic analysis. Part 2. Identification of drugs by principal components analysis of standardized TLC data in four eluent systems and of retention indices on SE 30,
J. Anal. Toxicol., 1987, 11, 4, 154-163, https://doi.org/10.1093/jat/11.4.154
. [all data]
Schepers, Wijsbeek, et al., 1982
Schepers, P.; Wijsbeek, J.; Franke, J.P.; de Zeeuw, R.A.,
Applicability of capillary gas chromatography to substance identification in toxicology by means of retention indices,
J. Forensic Sci., 1982, 27, 1, 49-60. [all data]
McLinden and Stenhouse, 1979
McLinden, V.J.; Stenhouse, A.M.,
A chromatography system for drug identification,
Forensic Sci. Int., 1979, 13, 71-79, https://doi.org/10.1016/0379-0738(79)90265-2
. [all data]
Christ, Noomano, et al., 1988
Christ, D.W.; Noomano, P.; Rosas, M.; Rhone, D.,
Retention indices by wide-bore capillary gas chromatography with nitrogen-phosphorus detection,
J. Anal. Toxicol., 1988, 12, 2, 84-88, https://doi.org/10.1093/jat/12.2.84
. [all data]
Perrigo, Peel, et al., 1985
Perrigo, B.J.; Peel, H.W.; Ballantyne, D.J.,
Use of Dual-Column Fused-Silica Capillary Gas Chromatography in Combination with Detector Response Factors for Analytical Toxicology.,
J. Chromatogr., 1985, 341, 81-88, https://doi.org/10.1016/S0378-4347(00)84011-6
. [all data]
Perrigo, Ballantyne, et al., 1984
Perrigo, B.J.; Ballantyne, D.J.; Peel, H.W.,
Condierations in developing a data base for drugs on a DBI capillary column,
J. Can. Soc. Forensic Sci., 1984, 17, 2, 41-49, https://doi.org/10.1080/00085030.1984.10757360
. [all data]
Anderson and Stafford, 1983
Anderson, W.H.; Stafford, D.T.,
Applications of capillary gas chromatography in routine toxicological analyses,
J. Hi. Res. Chromatogr. Chromatogr. Comm., 1983, 6, 5, 247-254, https://doi.org/10.1002/jhrc.1240060506
. [all data]
Perrigo and Peel, 1981
Perrigo, B.J.; Peel, H.W.,
The use of retention indices and temperature-programmed gas chromatography in analytical toxicology,
J. Chromatogr. Sci., 1981, 19, 5, 219-226, https://doi.org/10.1093/chromsci/19.5.219
. [all data]
MHA, 9999
MHA, Directorate of ForensicScience.,
Forensic Toxicology, 9999. [all data]
Phillips, Logan, et al., 1990
Phillips, A.M.; Logan, B.K.; Stafford, D.T.,
Further applications for capillary gas chromatography in routine quantitative toxicological analyses,
J. Hi. Res. Chromatogr., 1990, 13, 11, 754-758, https://doi.org/10.1002/jhrc.1240131106
. [all data]
Marozzi, Gambaro, et al., 1982
Marozzi, E.; Gambaro, V.; Saligari, E.; Mariani, R.; Lodi, F.,
Use of the retention index in gas chromatographic studies of drugs,
J. Anal. Toxicol., 1982, 6, 4, 185-192, https://doi.org/10.1093/jat/6.4.185
. [all data]
Peel and Perrigo, 1976
Peel, H.W.; Perrigo, B.,
A practical gas chromatographic screening procedure for toxicological analysis,
Can. Soc. Forens. Sci. J., 1976, 9, 2, 69-74, https://doi.org/10.1080/00085030.1976.10757247
. [all data]
Peel and Perrigo, 1975
Peel, H.W.; Perrigo, B.,
A practical gas chromatographic screening procedure for toxicological analysis,
Can.Soc.Forens.Sci.J., 1975, 9, 2, 69-74, https://doi.org/10.1080/00085030.1976.10757247
. [all data]
Waggott and Davies, 1984
Waggott, A.; Davies, I.W.,
Identification of organic pollutants using linear temperature programmed retention indices (LTPRIs) - Part II, 1984, retrieved from http://dwi.defra.gov.uk/research/completed-research/reports/dwi0383.pdf. [all data]
Ardrey and Moffat, 1981
Ardrey, R.E.; Moffat, A.C.,
Gas-liquid chromatographic retention indices of 1318 substances of toxicological interest on SE-30 or OV-1 stationary phase,
J. Chromatogr., 1981, 220, 3, 195-252, https://doi.org/10.1016/S0021-9673(00)81925-1
. [all data]