Pyrazolidine
- Formula: C3H8N2
- Molecular weight: 72.1090
- IUPAC Standard InChIKey: USPWKWBDZOARPV-UHFFFAOYSA-N
- CAS Registry Number: 504-70-1
- Chemical structure:
View 3d structure (requires JavaScript / HTML 5) - Permanent link for this species. Use this link for bookmarking this species for future reference.

Phase change data

Data compiled by: Robert L. Brown and Stephen E. Stein
Reduced pressure boiling point
Tboil (K) | Pressure (bar) | Reference |
---|---|---|
339.2 | 0.053 | Weast and Grasselli, 1989 |
411.2 | 0.933 | Weast and Grasselli, 1989 |

Gas phase ion energetics data

Data compiled as indicated in comments:
LLK - Sharon G. Lias, Rhoda D. Levin, and Sherif A. Kafafi
Ionization energy determinations
IE (eV) | Method | Reference | Comment |
---|---|---|---|
9.16 | PE | Nelsen and Buschek, 1974 | Vertical value; LLK |
9.158 | PE | Nelsen and Buschek, 1974, 2 | Vertical value; LLK |
7.90 | PE | Rademacher, 1973 | Vertical value; LLK |

References

Weast and Grasselli, 1989
CRC Handbook of Data on Organic Compounds, 2nd Editon, Weast,R.C and Grasselli, J.G., ed(s)., CRC Press, Inc., Boca Raton, FL, 1989, 1. [all data]
Nelsen and Buschek, 1974
Nelsen, S.F.; Buschek, J.M.,
Photoelectron spectra of hydrazines. V. Pyrazolidine and hexahydropyridazine derivatives,
J. Am. Chem. Soc., 1974, 96, 6987. [all data]
Nelsen and Buschek, 1974, 2
Nelsen, S.F.; Buschek, J.M.,
Photoelectron spectra of hydrazines. IV. Empirical estimation of lone pair-lone pair dihedral angles and prediction of lone pair ionization potentials for some cyclic and bicyclic hydrazines,
J. Am. Chem. Soc., 1974, 96, 6982. [all data]
Rademacher, 1973
Rademacher, P.,
Photoelectron spectra and conformation of hydrazine derivatives,
Angew. Chem. Int. Ed. Engl., 1973, 12, 408. [all data]