1,2-Propadiene-1,3-dione
- Formula: C3O2
- Molecular weight: 68.0309
- IUPAC Standard InChIKey: GNEVIACKFGQMHB-UHFFFAOYSA-N
- CAS Registry Number: 504-64-3
- Chemical structure:
View 3d structure (requires JavaScript / HTML 5) - Other names: Carbon suboxide; Carbon oxide (C3O2); C3O2

Gas phase thermochemistry data

Data compiled as indicated in comments:
ALS - Hussein Y. Afeefy, Joel F. Liebman, and Stephen E. Stein
Quantity | Value | Units | Method | Reference | Comment |
---|---|---|---|---|---|
ΔfH°gas | -93.64 | kJ/mol | Review | Chase, 1998 | Data last reviewed in June, 1968 |
ΔfH°gas | -97.8 ± 1.8 | kJ/mol | Ccr | Kybett, Johnson, et al., 1965 | ALS |
Quantity | Value | Units | Method | Reference | Comment |
S°gas,1 bar | 276.07 | J/mol*K | Review | Chase, 1998 | Data last reviewed in June, 1968 |
Gas Phase Heat Capacity (Shomate Equation)
Cp° = A + B*t + C*t2 + D*t3 +
E/t2
H° − H°298.15= A*t + B*t2/2 +
C*t3/3 + D*t4/4 − E/t + F − H
S° = A*ln(t) + B*t + C*t2/2 + D*t3/3 −
E/(2*t2) + G
Cp = heat capacity (J/mol*K)
H° = standard enthalpy (kJ/mol)
S° = standard entropy (J/mol*K)
t = temperature (K) / 1000.
View plot Requires a JavaScript / HTML 5 canvas capable browser.
Temperature (K) | 298. to 1200. | 1200. to 6000. |
---|---|---|
A | 51.83223 | 106.5761 |
B | 82.07920 | 3.008431 |
C | -44.90311 | -0.585714 |
D | 9.130785 | 0.039383 |
E | -0.494976 | -12.06958 |
F | -114.0219 | -153.2486 |
G | 313.4544 | 367.6627 |
H | -93.63792 | -93.63792 |
Reference | Chase, 1998 | Chase, 1998 |
Comment | Data last reviewed in June, 1968 | Data last reviewed in June, 1968 |

Condensed phase thermochemistry data

Data compiled by: Hussein Y. Afeefy, Joel F. Liebman, and Stephen E. Stein
Quantity | Value | Units | Method | Reference | Comment |
---|---|---|---|---|---|
ΔfH°liquid | -121.5 ± 1.0 | kJ/mol | Ccr | Kybett, Johnson, et al., 1965 | |
Quantity | Value | Units | Method | Reference | Comment |
ΔcH°liquid | -1059.1 | kJ/mol | Ccr | Kybett, Johnson, et al., 1965 | Corresponding ΔfHºliquid = -121.4 kJ/mol (simple calculation by NIST; no Washburn corrections) |

Phase change data

Data compiled as indicated in comments:
AC - William E. Acree, Jr., James S. Chickos
Enthalpy of vaporization
ΔvapH (kJ/mol) | Temperature (K) | Method | Reference | Comment |
---|---|---|---|---|
26.2 | 234. | A | Stephenson and Malanowski, 1987 | Based on data from 161. to 249. K. See also McDougall and Kilpatrick, 1965.; AC |
Antoine Equation Parameters
log10(P) = A − (B / (T + C))
P = vapor pressure (bar)
T = temperature (K)
View plot Requires a JavaScript / HTML 5 canvas capable browser.
Temperature (K) | A | B | C | Reference | Comment |
---|---|---|---|---|---|
160.96 to 248.78 | 4.5833 | 1207.884 | -14.911 | McDougall and Kilpatrick, 1965, 2 | Coefficents calculated by NIST from author's data. |

Gas phase ion energetics data

Data compiled as indicated in comments:
LLK - Sharon G. Lias, Rhoda D. Levin, and Sherif A. Kafafi
RDSH - Henry M. Rosenstock, Keith Draxl, Bruce W. Steiner, and John T. Herron
LL - Sharon G. Lias and Joel F. Liebman
B - John E. Bartmess
Electron affinity determinations
EA (eV) | Method | Reference | Comment |
---|---|---|---|
0.85 ± 0.15 | LPES | Oakes and Ellison, 1986 | B |
Ionization energy determinations
IE (eV) | Method | Reference | Comment |
---|---|---|---|
10.605 | PE | Rabalais, Bergmark, et al., 1972 | LLK |
10.60 | PE | Baker and Turner, 1968 | RDSH |
10.60 ± 0.03 | PI | Kim and Roebber, 1966 | RDSH |
10.60 | S | Kim and Roebber, 1966 | RDSH |
Appearance energy determinations
Ion | AE (eV) | Other Products | Method | Reference | Comment |
---|---|---|---|---|---|
C+ | 18.7 ± 0.3 | 2CO | EI | Botter, 1963 | RDSH |
CO+ | 20.1 ± 0.3 | ? | EI | Botter, 1963 | RDSH |
C2+ | 24.5 ± 0.7 | ? | EI | Botter, 1963 | RDSH |
C2O+ | 14.7 ± 0.1 | CO | EI | Chen and Holmes, 1994 | LL |
C2O+ | 14.48 ± 0.05 | CO | EI | Chen and Holmes, 1994 | LL |
C2O+ | 15. ± 0. | CO | EI | Botter, 1963 | RDSH |
C2O2+ | 15.8 | ? | EI | Botter, 1963 | RDSH |
C3+ | 29.8 ± 0.4 | ? | EI | Botter, 1963 | RDSH |
C3O+ | 15.9 ± 0.3 | O | EI | Botter, 1963 | RDSH |
O+ | 25.8 ± 0.5 | ? | EI | Botter, 1963 | RDSH |

References

Chase, 1998
Chase, M.W., Jr.,
NIST-JANAF Themochemical Tables, Fourth Edition,
J. Phys. Chem. Ref. Data, Monograph 9, 1998, 1-1951. [all data]
Kybett, Johnson, et al., 1965
Kybett, B.D.; Johnson, G.K.; Barker, C.K.; Margrave, J.L.,
The heats of formation and polymerization of carbon suboxide,
J. Phys. Chem., 1965, 69, 3603-3606. [all data]
Stephenson and Malanowski, 1987
Stephenson, Richard M.; Malanowski, Stanislaw,
Handbook of the Thermodynamics of Organic Compounds, 1987, https://doi.org/10.1007/978-94-009-3173-2
. [all data]
McDougall and Kilpatrick, 1965
McDougall, Lee A.; Kilpatrick, John E.,
Entropy and Related Thermodynamic Properties of Carbon Suboxide,
J. Chem. Phys., 1965, 42, 7, 2311, https://doi.org/10.1063/1.1696294
. [all data]
McDougall and Kilpatrick, 1965, 2
McDougall, L.A.; Kilpatrick, J.E.,
Entropy and Related Thermodynamic Properties of Carbon Suboxide,
J. Chem. Phys., 1965, 42, 7, 2311-2321, https://doi.org/10.1063/1.1696294
. [all data]
Oakes and Ellison, 1986
Oakes, J.M.; Ellison, G.B.,
Photoelectron spectroscopy of radical anions,
Tetrahedron, 1986, 42, 6263. [all data]
Rabalais, Bergmark, et al., 1972
Rabalais, J.W.; Bergmark, T.; Werme, L.O.; Karlson, L.; Hussain, M.; Siebahn, K.,
The high-resolution electron spectrum of carbon suboxide
in Electron Spectroscopy, ed. D.A. Shirley (North-Holland Pub. Co., Amsterdam), 1972, 425. [all data]
Baker and Turner, 1968
Baker, C.; Turner, D.W.,
The photoelectron spectrum and ionisation potentials of carbon suboxide,
Chem. Commun., 1968, 400. [all data]
Kim and Roebber, 1966
Kim, H.H.; Roebber, J.L.,
Vacuum-ultraviolet absorption spectrum of carbon suboxide,
J. Chem. Phys., 1966, 44, 1709. [all data]
Botter, 1963
Botter, R.,
Carbon sub-oxide,
Advan. Mass Spectrom., 1963, 2, 540. [all data]
Chen and Holmes, 1994
Chen, H.; Holmes, J.L.,
The generation of OC2O+ and OC2O and a study of ionized OC3O and C2O by tandem mass spectrometry,
Int. J. Mass Spectrom. Ion Processes, 1994, 133, 111. [all data]