1,3-Propanediol
- Formula: C3H8O2
- Molecular weight: 76.0944
- IUPAC Standard InChIKey: YPFDHNVEDLHUCE-UHFFFAOYSA-N
- CAS Registry Number: 504-63-2
- Chemical structure:
View 3d structure (requires JavaScript / HTML 5) - Other names: β-Propylene glycol; Propane-1,3-diol; PG; Trimethylene glycol; 1,3-Dihydroxypropane; 1,3-Propylene glycol; 2-Deoxyglycerol; Propanediol-(1,3); ω-Propanediol; 1,3-Propylenediol; 2-(Hydroxymethyl)ethanol; NSC 65426; Polypropylene glycol 425

Gas phase thermochemistry data

Data compiled by: Hussein Y. Afeefy, Joel F. Liebman, and Stephen E. Stein
Quantity | Value | Units | Method | Reference | Comment |
---|---|---|---|---|---|
ΔfH°gas | -408.4 ± 5.1 | kJ/mol | Ccr | Knauth and Sabbah, 1990 | see Knauth and Sabbah, 1989 |
ΔfH°gas | -392. ± 3. | kJ/mol | Ccb | Gardner and Hussain, 1972 |

Condensed phase thermochemistry data

Data compiled by: Hussein Y. Afeefy, Joel F. Liebman, and Stephen E. Stein
Quantity | Value | Units | Method | Reference | Comment |
---|---|---|---|---|---|
ΔfH°liquid | -480.8 ± 5.1 | kJ/mol | Ccr | Knauth and Sabbah, 1990 | see Knauth and Sabbah, 1989 |
ΔfH°liquid | -465. ± 3. | kJ/mol | Ccb | Gardner and Hussain, 1972 | |
Quantity | Value | Units | Method | Reference | Comment |
ΔcH°liquid | -1843.0 ± 5.1 | kJ/mol | Ccr | Knauth and Sabbah, 1990 | see Knauth and Sabbah, 1989; Corresponding ΔfHºliquid = -480.9 kJ/mol (simple calculation by NIST; no Washburn corrections) |
ΔcH°liquid | -1859. ± 2.3 | kJ/mol | Ccb | Gardner and Hussain, 1972 | Corresponding ΔfHºliquid = -464.8 kJ/mol (simple calculation by NIST; no Washburn corrections) |

Phase change data

Data compiled as indicated in comments:
BS - Robert L. Brown and Stephen E. Stein
TRC - Thermodynamics Research Center, NIST Boulder Laboratories, Chris Muzny director
AC - William E. Acree, Jr., James S. Chickos
DRB - Donald R. Burgess, Jr.
ALS - Hussein Y. Afeefy, Joel F. Liebman, and Stephen E. Stein
Quantity | Value | Units | Method | Reference | Comment |
---|---|---|---|---|---|
Tboil | 487. ± 3. | K | AVG | N/A | Average of 11 out of 12 values; Individual data points |
Quantity | Value | Units | Method | Reference | Comment |
Tfus | 332. | K | N/A | Lipkin and Layloff, 1970 | Uncertainty assigned by TRC = 2. K; TRC |
Tfus | 246.5 | K | N/A | Anonymous, 1953 | Uncertainty assigned by TRC = 0.6 K; TRC |
Tfus | 241.15 | K | N/A | Gallaugher and Hibbert, 1936 | Uncertainty assigned by TRC = 0.7 K; TRC |
Quantity | Value | Units | Method | Reference | Comment |
Ttriple | 245.5 | K | N/A | Knauth and Sabbah, 1990, 2 | Uncertainty assigned by TRC = 0.1 K; TRC |
Quantity | Value | Units | Method | Reference | Comment |
ΔvapH° | 70. ± 5. | kJ/mol | AVG | N/A | Average of 11 values; Individual data points |
Reduced pressure boiling point
Tboil (K) | Pressure (bar) | Reference | Comment |
---|---|---|---|
383.2 | 0.016 | Weast and Grasselli, 1989 | BS |
Enthalpy of vaporization
ΔvapH (kJ/mol) | Temperature (K) | Method | Reference | Comment |
---|---|---|---|---|
57.2 | 347. | A | Stephenson and Malanowski, 1987 | Based on data from 332. to 448. K. See also Stull, 1947.; AC |
73. ± 2. | 383. | V | Gardner and Hussain, 1972 | ALS |
57.86 | 273. | V | Gallaugher and Hibbert, 1937 | ALS |
63.3 | 408. | N/A | Schierholtz and Staples, 1935 | Based on data from 383. to 433. K.; AC |
60.4 | 460. | N/A | Schierholtz and Staples, 1935 | Based on data from 433. to 488. K.; AC |
Antoine Equation Parameters
log10(P) = A − (B / (T + C))
P = vapor pressure (bar)
T = temperature (K)
View plot Requires a JavaScript / HTML 5 canvas capable browser.
Temperature (K) | A | B | C | Reference | Comment |
---|---|---|---|---|---|
332.6 to 487.4 | 6.29523 | 3105.018 | 6.101 | Stull, 1947 | Coefficents calculated by NIST from author's data. |
Enthalpy of fusion
ΔfusH (kJ/mol) | Temperature (K) | Method | Reference | Comment |
---|---|---|---|---|
11.4 | 249. | DSC | Jabrane, Létoffé, et al., 1998 | AC |

Reaction thermochemistry data

Data compiled by: Hussein Y. Afeefy, Joel F. Liebman, and Stephen E. Stein
Individual Reactions
By formula: C3H8O2 + C3H6O = C6H12O2 + H2O
Quantity | Value | Units | Method | Reference | Comment |
---|---|---|---|---|---|
ΔrH° | -23. | kJ/mol | Eqk | Anteunis and Rommelaere, 1970 | liquid phase |

Henry's Law data

Data compiled by: Rolf Sander
Henry's Law constant (water solution)
kH(T) = k°H exp(d(ln(kH))/d(1/T) ((1/T) - 1/(298.15 K)))
k°H = Henry's law constant for solubility in water at 298.15 K (mol/(kg*bar))
d(ln(kH))/d(1/T) = Temperature dependence constant (K)
k°H (mol/(kg*bar)) | d(ln(kH))/d(1/T) (K) | Method | Reference | Comment |
---|---|---|---|---|
910000. | M | N/A | Value at T = 293. K. |

Gas phase ion energetics data

Data evaluated as indicated in comments:
HL - Edward P. Hunter and Sharon G. Lias
Data compiled as indicated in comments:
MM - Michael M. Meot-Ner (Mautner)
LBLHLM - Sharon G. Lias, John E. Bartmess, Joel F. Liebman, John L. Holmes, Rhoda D. Levin, and W. Gary Mallard
Quantity | Value | Units | Method | Reference | Comment |
---|---|---|---|---|---|
Proton affinity (review) | 876.2 | kJ/mol | N/A | Hunter and Lias, 1998 | HL |
Quantity | Value | Units | Method | Reference | Comment |
Gas basicity | 825.9 | kJ/mol | N/A | Hunter and Lias, 1998 | HL |
Proton affinity at 298K
Proton affinity (kJ/mol) | Reference | Comment |
---|---|---|
>850.4 | Bouchoux, Buisson, et al., 2003 | MM |
>837.9 | Bouchoux, Buisson, et al., 2003 | MM |
>857.6 ± 0.5 | Bouchoux, Buisson, et al., 2003 | MM |
Gas basicity at 298K
Gas basicity (review) (kJ/mol) | Reference | Comment |
---|---|---|
820.0 | Bouchoux, Buisson, et al., 2003 | MM |
808.0 | Bouchoux, Buisson, et al., 2003 | MM |
827.3 ± 0.2 | Bouchoux, Buisson, et al., 2003 | MM |
Appearance energy determinations
Ion | AE (eV) | Other Products | Method | Reference | Comment |
---|---|---|---|---|---|
C2H5O+ | 10.42 ± 0.05 | ? | EI | Burgers, Terlouw, et al., 1982 | LBLHLM |
C2H6O+ | 10.80 | CH2O | EI | Postma, Ruttink, et al., 1986 | LBLHLM |
C2H6O+ | 11.0 ± 0.1 | CH2O | EI | Holmes, Lossing, et al., 1982 | LBLHLM |

Kovats' RI, non-polar column, isothermal

Column type | Active phase | Temperature (C) | I | Reference | Comment |
---|---|---|---|---|---|
Packed | SE-30 | 150. | 820. | Tiess, 1984 | Ar, Gas Chrom Q (80-100 mesh); Column length: 3. m |
Packed | Apiezon L | 160. | 781. | Bogoslovsky, Anvaer, et al., 1978 | Celite 545 |
Packed | SE-30 | 175. | 812. | Casteignau and Villessot, 1968 | Column length: 3. m |

Kovats' RI, polar column, isothermal

Column type | Active phase | Temperature (C) | I | Reference | Comment |
---|---|---|---|---|---|
Packed | PEG-2000 | 152. | 1820. | Anderson, Jurel, et al., 1973 | He, Celite 545 (44-60 mesh); Column length: 3. m |
Packed | PEG-2000 | 179. | 1790. | Anderson, Jurel, et al., 1973 | He, Celite 545 (44-60 mesh); Column length: 3. m |
Packed | PEG-2000 | 180. | 1789. | Anderson, Jurel, et al., 1973 | He, Celite 545 (44-60 mesh); Column length: 3. m |
Packed | PEG-2000 | 200. | 1770. | Anderson, Jurel, et al., 1973 | He, Celite 545 (44-60 mesh); Column length: 3. m |
Packed | PEG-2000 | 200. | 1799. | Anderson, Jurel, et al., 1973 | He, Celite 545 (44-60 mesh); Column length: 3. m |
Packed | Carbowax 20M | 175. | 1747. | Casteignau and Villessot, 1968 | Column length: 3. m |

Van Den Dool and Kratz RI, non-polar column, custom temperature program

Column type | Active phase | I | Reference | Comment |
---|---|---|---|---|
Capillary | DB-1 | 814. | Peng, 2000 | 15. m/0.53 mm/1. μm, He; Program: 40C(3min) => 8C/min => 200(1min) => 5C/min => 300C(25min) |

Normal alkane RI, non-polar column, custom temperature program

Column type | Active phase | I | Reference | Comment |
---|---|---|---|---|
Capillary | SPB-1 | 793. | Flanagan, Streete, et al., 1997 | 60. m/0.53 mm/5. μm, He; Program: 40C(6min) => 5C/min => 80C => 10C/min => 200C |
Capillary | SPB-1 | 793. | Strete, Ruprah, et al., 1992 | 60. m/0.53 mm/5.0 μm, Helium; Program: 40 0C (6 min) 5 0C/min -> 80 0C 10 0C/min -> 200 0C |
Capillary | SPB-1 | 820. | Strete, Ruprah, et al., 1992 | 60. m/0.53 mm/5.0 μm, Helium; Program: not specified |

Normal alkane RI, polar column, custom temperature program

Column type | Active phase | I | Reference | Comment |
---|---|---|---|---|
Capillary | DB-Wax | 1789. | Peng, Yang, et al., 1991 | Program: not specified |

References

Knauth and Sabbah, 1990
Knauth, P.; Sabbah, R.,
Energetics of intra- and intermolecular bonds in ω-alkanediols (II) Thermochemical study of 1,2-ethanediol, 1,3-propanediol, 1,4-butanediol, and 1,5-pentanediol at 298.15K,
Struct. Chem., 1990, 1, 43-46. [all data]
Knauth and Sabbah, 1989
Knauth, P.; Sabbah, R.,
Combustion calorimetry on milligram samples of liquid substances with a CRMT rocking bomb calorimeter. Application to the study of ω-alkanediol at 298.15 K,
J. Chem. Thermodyn., 1989, 21, 203-210. [all data]
Gardner and Hussain, 1972
Gardner, P.J.; Hussain, K.S.,
The standard enthalpies of formation of some aliphatic diols,
J. Chem. Thermodyn., 1972, 4, 819-827. [all data]
Lipkin and Layloff, 1970
Lipkin, D.; Layloff, T.,
Cyclic Sulfite and Sulfate Esters of Polymethylene Glycols,
J. Chem. Eng. Data, 1970, 15, 450. [all data]
Anonymous, 1953
Anonymous, R.,
, Physical Properties of Chemical Substances, Dow Chemical Company, 1953. [all data]
Gallaugher and Hibbert, 1936
Gallaugher, A.F.; Hibbert, H.,
Studies on reactions relating to carbohydrates and polysaccharides: xlix molecular weight, molar refraction, freezing point and other properties of the polyethylene glycols and their derivatives,
J. Am. Chem. Soc., 1936, 58, 813. [all data]
Knauth and Sabbah, 1990, 2
Knauth, P.; Sabbah, R.,
Can. J. Chem., 1990, 68, 731. [all data]
Weast and Grasselli, 1989
CRC Handbook of Data on Organic Compounds, 2nd Editon, Weast,R.C and Grasselli, J.G., ed(s)., CRC Press, Inc., Boca Raton, FL, 1989, 1. [all data]
Stephenson and Malanowski, 1987
Stephenson, Richard M.; Malanowski, Stanislaw,
Handbook of the Thermodynamics of Organic Compounds, 1987, https://doi.org/10.1007/978-94-009-3173-2
. [all data]
Stull, 1947
Stull, Daniel R.,
Vapor Pressure of Pure Substances. Organic and Inorganic Compounds,
Ind. Eng. Chem., 1947, 39, 4, 517-540, https://doi.org/10.1021/ie50448a022
. [all data]
Gallaugher and Hibbert, 1937
Gallaugher, A.F.; Hibbert, H.,
Studies on reactions relating to carbohydrates and polysaccharides. LV. Vapor pressures of the polyethylene glycols and their derivatives,
J. Am. Chem. Soc., 1937, 59, 2521-2525. [all data]
Schierholtz and Staples, 1935
Schierholtz, O.J.; Staples, M.L.,
Vapor Pressures of Certain Glycols,
J. Am. Chem. Soc., 1935, 57, 12, 2709-2711, https://doi.org/10.1021/ja01315a106
. [all data]
Jabrane, Létoffé, et al., 1998
Jabrane, S.; Létoffé, J.M.; Claudy, P.,
Study of the thermal behaviour of 1,3-propanediol and its aqueous solutions,
Thermochimica Acta, 1998, 311, 1-2, 121-127, https://doi.org/10.1016/S0040-6031(97)00416-4
. [all data]
Anteunis and Rommelaere, 1970
Anteunis, M.; Rommelaere, Y.,
NMR experiments on acetals. XXIX. The ease of acetonide formation of some glycols,
Bull. Soc. Chim. Belg., 1970, 79, 523-530. [all data]
Hunter and Lias, 1998
Hunter, E.P.; Lias, S.G.,
Evaluated Gas Phase Basicities and Proton Affinities of Molecules: An Update,
J. Phys. Chem. Ref. Data, 1998, 27, 3, 413-656, https://doi.org/10.1063/1.556018
. [all data]
Bouchoux, Buisson, et al., 2003
Bouchoux, G.; Buisson, D.A.; Bourcier, S.; Sablier, M.,
Application of the kinetic method to bifunctional bases. ESI tandem quadrupole experiments,
Int. J. Mass Spectrom., 2003, 228, 1035. [all data]
Burgers, Terlouw, et al., 1982
Burgers, P.C.; Terlouw, J.K.; Holmes, J.L.,
The vinyloxonium cation, CH2=CH-OH2+, a stable [C2H5O]+ species in the gas phase,
Org. Mass Spectrom., 1982, 17, 369. [all data]
Postma, Ruttink, et al., 1986
Postma, R.; Ruttink, P.J.A.; Van Baar, B.; Terlouw, J.K.; Holmes, J.L.; Burgers, P.C.,
Isometric distonic and H-bridged [C2H6O]+ radical cations,
Chem. Phys. Lett., 1986, 123, 409. [all data]
Holmes, Lossing, et al., 1982
Holmes, J.L.; Lossing, F.P.; Terlouw, J.K.; Burgers, P.C.,
The radical cation [CH2OH2]+ and related stable gas phase ion-dipole complexes,
J. Am. Chem. Soc., 1982, 104, 2931. [all data]