2-Buten-1-ol, (E)-
- Formula: C4H8O
- Molecular weight: 72.1057
- IUPAC Standard InChIKey: WCASXYBKJHWFMY-NSCUHMNNSA-N
- CAS Registry Number: 504-61-0
- Chemical structure:
View 3d structure (requires JavaScript / HTML 5) - Stereoisomers:
- Other names: trans-Crotonyl Alcohol; trans-Crotyl Alcohol; trans-2-Buten-1-Ol; trans-2-Butenol; trans-2-Butenyl alcohol; 2-(E)-Buten-1-ol; (E)-2-Buten-1-ol

Phase change data

Data compiled by: Robert L. Brown and Stephen E. Stein
Quantity | Value | Units | Method | Reference | Comment |
---|---|---|---|---|---|
Tboil | 394.4 | K | N/A | Weast and Grasselli, 1989 |

Reaction thermochemistry data

Data compiled by: John E. Bartmess
Individual Reactions
C4H7O- + =
By formula: C4H7O- + H+ = C4H8O
Quantity | Value | Units | Method | Reference | Comment |
---|---|---|---|---|---|
ΔrH° | 1564. ± 12. | kJ/mol | G+TS | Graul, Schnute, et al., 1990 | gas phase; Mixture of cis and trans isomers |
Quantity | Value | Units | Method | Reference | Comment |
ΔrG° | 1536. ± 12. | kJ/mol | CIDC | Graul, Schnute, et al., 1990 | gas phase; Mixture of cis and trans isomers |

Gas phase ion energetics data

Data compiled as indicated in comments:
B - John E. Bartmess
LBLHLM - Sharon G. Lias, John E. Bartmess, Joel F. Liebman, John L. Holmes, Rhoda D. Levin, and W. Gary Mallard
Ionization energy determinations
IE (eV) | Method | Reference | Comment |
---|---|---|---|
9.15 | EI | McAdoo and Hudson, 1983 | LBLHLM |
De-protonation reactions
C4H7O- + =
By formula: C4H7O- + H+ = C4H8O
Quantity | Value | Units | Method | Reference | Comment |
---|---|---|---|---|---|
ΔrH° | 1564. ± 12. | kJ/mol | G+TS | Graul, Schnute, et al., 1990 | gas phase; Mixture of cis and trans isomers; B |
Quantity | Value | Units | Method | Reference | Comment |
ΔrG° | 1536. ± 12. | kJ/mol | CIDC | Graul, Schnute, et al., 1990 | gas phase; Mixture of cis and trans isomers; B |

Kovats' RI, non-polar column, temperature ramp

Column type | Active phase | I | Reference | Comment |
---|---|---|---|---|
Capillary | SE-54 | 654. | Rembold, Wallner, et al., 1989 | 30. m/0.25 mm/0.25 μm, He, 0. C @ 12. min, 12. K/min; Tend: 250. C |

Van Den Dool and Kratz RI, polar column, temperature ramp

Column type | Active phase | I | Reference | Comment |
---|---|---|---|---|
Capillary | DB-Wax | 1215. | Cha, Kim, et al., 1998 | 60. m/0.25 mm/0.25 μm, 40. C @ 5. min, 3. K/min, 200. C @ 60. min |

References

Weast and Grasselli, 1989
CRC Handbook of Data on Organic Compounds, 2nd Editon, Weast,R.C and Grasselli, J.G., ed(s)., CRC Press, Inc., Boca Raton, FL, 1989, 1. [all data]
Graul, Schnute, et al., 1990
Graul, S.T.; Schnute, M.E.; Squires, R.R.,
Gas-Phase Acidities of Carboxylic Acids and Alcohols from Collision-Induced Dissociation of Dimer Cluster Ions,
Int. J. Mass Spectrom. Ion Proc., 1990, 96, 2, 181, https://doi.org/10.1016/0168-1176(90)87028-F
. [all data]
McAdoo and Hudson, 1983
McAdoo, D.J.; Hudson, C.E.,
The decompositions of metastable [C4H8O]+ ions and the [C4H8O]+ potential surface,
Org. Mass Spectrom., 1983, 18, 466. [all data]
Rembold, Wallner, et al., 1989
Rembold, H.; Wallner, P.; Nitz, S.; Kollmannsberger, H.; Drawert, F.,
Volatile components of chickpea (Cicer arietinum L.) seed,
J. Agric. Food Chem., 1989, 37, 3, 659-662, https://doi.org/10.1021/jf00087a018
. [all data]
Cha, Kim, et al., 1998
Cha, Y.J.; Kim, H.; Cadwallader, K.R.,
Aroma-active compounds in Kimchi during fermentation,
J. Agric. Food Chem., 1998, 46, 5, 1944-1953, https://doi.org/10.1021/jf9706991
. [all data]