2,4(1H,3H)-Pyrimidinedione, dihydro-
- Formula: C4H6N2O2
- Molecular weight: 114.1026
- IUPAC Standard InChIKey: OIVLITBTBDPEFK-UHFFFAOYSA-N
- CAS Registry Number: 504-07-4
- Chemical structure:
View 3d structure (requires JavaScript / HTML 5) - Other names: Hydrouracil; Dihydrouracil; 5,6-Dihydro-2,4-dihydroxypyrimidine; 5,6-Dihydrouracil; Dihydro-2,4(1H,3H)-pyrimidinedione; Dihydro-pyrimidine-2,4-dione

Gas phase ion energetics data

Data compiled by: Sharon G. Lias, Rhoda D. Levin, and Sherif A. Kafafi
Ionization energy determinations
IE (eV) | Method | Reference | Comment |
---|---|---|---|
10.0 ± 0.1 | EI | Verkin, Sukodub, et al., 1976 | |
10.00 | PE | Dougherty, Wittel, et al., 1976 | Vertical value |

References

Verkin, Sukodub, et al., 1976
Verkin, B.I.; Sukodub, L.F.; Yanson, I.K.,
Ionization potentials of nitrogenous bases of of nucleic acids,
Dokl. Akad. Nauk SSSR, 1976, 228, 1452. [all data]
Dougherty, Wittel, et al., 1976
Dougherty, D.; Wittel, K.; Meeks, J.; McGlynn, S.P.,
Photoelectron spectroscopy of carbonyls. Ureas, uracils, and thymine,
J. Am. Chem. Soc., 1976, 98, 3815. [all data]