Pyridine, 2-[2-(2-nitrophenyl)ethenyl]-
- Formula: C13H10N2O2
- Molecular weight: 226.2307
- IUPAC Standard InChIKey: YADNATDOWRSAOC-CMDGGOBGSA-N
- CAS Registry Number: 50385-24-5
- Chemical structure:
View 3d structure (requires JavaScript / HTML 5) - Species with the same structure:

Gas phase ion energetics data

Data compiled as indicated in comments:
LLK - Sharon G. Lias, Rhoda D. Levin, and Sherif A. Kafafi
Ionization energy determinations
IE (eV) | Method | Reference | Comment |
---|---|---|---|
8.30 | EI | Grutzmacher, Schaldach, et al., 1980 | LLK |
Appearance energy determinations
Ion | AE (eV) | Other Products | Method | Reference | Comment |
---|---|---|---|---|---|
C13H10N+ | 8.8 | NO2 | EI | Grutzmacher, Schaldach, et al., 1980 | LLK |

References

Grutzmacher, Schaldach, et al., 1980
Grutzmacher, H.-F.; Schaldach, B.; Schubert, R.; Ramana, D.V.,
Ion kinetic energy release as a transition state probe in intramolecular aromatic substitutions,
Adv. Mass Spectrom., 1980, 8, 795. [all data]