Silane, trimethyl-tert-butyl-
- Formula: C7H18Si
- Molecular weight: 130.3033
- IUPAC Standard InChIKey: FFXWYTYNILTGIL-UHFFFAOYSA-N
- CAS Registry Number: 5037-65-0
- Chemical structure:
View 3d structure (requires JavaScript / HTML 5) - Permanent link for this species. Use this link for bookmarking this species for future reference.

Gas phase ion energetics data

Data compiled as indicated in comments:
RDSH - Henry M. Rosenstock, Keith Draxl, Bruce W. Steiner, and John T. Herron
Ionization energy determinations
IE (eV) | Method | Reference | Comment |
---|---|---|---|
9.34 ± 0.06 | EI | Hess, Lampe, et al., 1965 | RDSH |
Appearance energy determinations
Ion | AE (eV) | Other Products | Method | Reference | Comment |
---|---|---|---|---|---|
C3H9Si+ | 10.53 ± 0.09 | ? | EI | Hess, Lampe, et al., 1964 | RDSH |
C4H9+ | 11.88 | ? | EI | Hess, Lampe, et al., 1964 | RDSH |

References

Hess, Lampe, et al., 1965
Hess, G.G.; Lampe, F.W.; Sommer, L.H.,
An electron impact study of ionization and dissociation of trimethylsilanes,
J. Am. Chem. Soc., 1965, 87, 5327. [all data]
Hess, Lampe, et al., 1964
Hess, G.G.; Lampe, F.W.; Sommer, L.H.,
Bond dissociation energies and ion energetics in organosilicon compounds by electron impact,
J. Am. Chem. Soc., 1964, 86, 3174. [all data]