Molybdenum, (carbonothioyl)pentacarbonyl-
- Formula: C6MoO5S
- Molecular weight: 280.09
- IUPAC Standard InChIKey: VTRMVCUIDZLAIY-UHFFFAOYSA-N
- CAS Registry Number: 50358-91-3
- Chemical structure:
View 3d structure (requires JavaScript / HTML 5) - Information on this page:

Gas phase ion energetics data

Data compiled by: Sharon G. Lias, Rhoda D. Levin, and Sherif A. Kafafi
Ionization energy determinations
IE (eV) | Method | Reference |
---|---|---|
8.18 ± 0.02 | EI | Michels, Flesch, et al., 1980 |
Appearance energy determinations
Ion | AE (eV) | Other Products | Method | Reference | Comment |
---|---|---|---|---|---|
CSMo+ | 16.07 ± 0.09 | 5CO | EI | Michels, Flesch, et al., 1980 | |
C2OSMo+ | 14.46 ± 0.05 | 4CO | EI | Michels, Flesch, et al., 1980 | |
C2O2Mo+ | 15.82 ± 0.30 | 3CO+CS | EI | Michels, Flesch, et al., 1980 | |
C3O2SMo+ | 12.39 ± 0.09 | 3CO | EI | Michels, Flesch, et al., 1980 | |
C3O3Mo+ | 14.05 ± 0.20 | 2CO+CS | EI | Michels, Flesch, et al., 1980 | |
C4O3SMo+ | 11.02 ± 0.05 | 2CO | EI | Michels, Flesch, et al., 1980 | |
C4O4Mo+ | 12.39 ± 0.20 | CO+CS | EI | Michels, Flesch, et al., 1980 | |
C5O4SMo+ | 9.36 ± 0.05 | CO | EI | Michels, Flesch, et al., 1980 | |
C5O5Mo+ | 10.96 ± 0.20 | CS | EI | Michels, Flesch, et al., 1980 | |
C12H36N6Mo2+ | 17.54 ± 0.30 | 4CO+CS | EI | Michels, Flesch, et al., 1980 | |
Mo+ | 19.12 ± 0.30 | 5CO+CS | EI | Michels, Flesch, et al., 1980 |

References

Michels, Flesch, et al., 1980
Michels, G.D.; Flesch, G.D.; Svec, H.J.,
Comparative mass spectrometry of the group 6B hexacarbonyls and pentacarbonyl thiocarbonyls,
Inorg. Chem., 1980, 19, 479. [all data]