Azetidine
- Formula: C3H7N
- Molecular weight: 57.0944
- IUPAC Standard InChIKey: HONIICLYMWZJFZ-UHFFFAOYSA-N
- CAS Registry Number: 503-29-7
- Chemical structure:
View 3d structure (requires JavaScript / HTML 5) - Other names: Azacyclobutane; Azete, tetrahydro-; Trimethylenimine; 1,3-Propylenimine; Trimethylene imine

Phase change data

Data compiled as indicated in comments:
BS - Robert L. Brown and Stephen E. Stein
AC - William E. Acree, Jr., James S. Chickos
Quantity | Value | Units | Method | Reference | Comment |
---|---|---|---|---|---|
Tboil | 334.7 | K | N/A | Aldrich Chemical Company Inc., 1990 | BS |
Tboil | 336. | K | N/A | Buckingham and Donaghy, 1982 | BS |
Enthalpy of vaporization
ΔvapH (kJ/mol) | Temperature (K) | Method | Reference | Comment |
---|---|---|---|---|
32.6 | 288. | A | Stephenson and Malanowski, 1987 | Based on data from 273. to 303. K.; AC |

Gas phase ion energetics data

Data evaluated as indicated in comments:
HL - Edward P. Hunter and Sharon G. Lias
Data compiled as indicated in comments:
LBLHLM - Sharon G. Lias, John E. Bartmess, Joel F. Liebman, John L. Holmes, Rhoda D. Levin, and W. Gary Mallard
LLK - Sharon G. Lias, Rhoda D. Levin, and Sherif A. Kafafi
RDSH - Henry M. Rosenstock, Keith Draxl, Bruce W. Steiner, and John T. Herron
LL - Sharon G. Lias and Joel F. Liebman
Quantity | Value | Units | Method | Reference | Comment |
---|---|---|---|---|---|
Proton affinity (review) | 943.4 | kJ/mol | N/A | Hunter and Lias, 1998 | HL |
Quantity | Value | Units | Method | Reference | Comment |
Gas basicity | 908.6 | kJ/mol | N/A | Hunter and Lias, 1998 | HL |
Ionization energy determinations
IE (eV) | Method | Reference | Comment |
---|---|---|---|
8.63 ± 0.02 | PI | Tarasenko, Tishenkov, et al., 1986 | LBLHLM |
8.3 | PE | Aue and Bowers, 1979 | LLK |
8.9 | EI | Kiser and Gallegos, 1962 | RDSH |
9.1 ± 0.15 | EI | Gallegos and Kiser, 1962 | RDSH |
9.04 ± 0.02 | PE | Yoshikawa, Hashimoto, et al., 1974 | Vertical value; LLK |
Appearance energy determinations
Ion | AE (eV) | Other Products | Method | Reference | Comment |
---|---|---|---|---|---|
CH2N+ | 9.98 ± 0.02 | C2H5 | PI | Tarasenko, Tishenkov, et al., 1986 | LBLHLM |
CH2N+ | 13.1 ± 0.2 | ? | EI | Gallegos and Kiser, 1962 | RDSH |
CH3+ | 14.4 ± 1.0 | ? | EI | Gallegos and Kiser, 1962 | RDSH |
CH3N+ | 10.46 ± 0.05 | C2H4 | EI | Holmes, Lossing, et al., 1992 | LL |
CH3N+ | 10.32 ± 0.08 | C2H4 | PI | Tarasenko, Tishenkov, et al., 1986 | LBLHLM |
CH3N+ | 10.46 ± 0.05 | C2H4 | EI | Burgers, Holmes, et al., 1984 | LBLHLM |
CH4N+ | 12.3 ± 0.2 | ? | EI | Gallegos and Kiser, 1962 | RDSH |
C2H2+ | 16.6 ± 0.5 | ? | EI | Gallegos and Kiser, 1962 | RDSH |
C2H4N+ | 11.9 ± 0.2 | CH3 | EI | Gallegos and Kiser, 1962 | RDSH |
C3H6N+ | 11.4 ± 0.2 | H | EI | Gallegos and Kiser, 1962 | RDSH |

Normal alkane RI, non-polar column, custom temperature program

Column type | Active phase | I | Reference | Comment |
---|---|---|---|---|
Capillary | Methyl Silicone | 599. | Farkas, Héberger, et al., 2004 | Program: not specified |

References

Aldrich Chemical Company Inc., 1990
Aldrich Chemical Company Inc.,
Catalog Handbook of Fine Chemicals, Aldrich Chemical Company, Inc., Milwaukee WI, 1990, 1. [all data]
Buckingham and Donaghy, 1982
Buckingham, J.; Donaghy, S.M.,
Dictionary of Organic Compounds: Fifth Edition, Chapman and Hall, New York, 1982, 1. [all data]
Stephenson and Malanowski, 1987
Stephenson, Richard M.; Malanowski, Stanislaw,
Handbook of the Thermodynamics of Organic Compounds, 1987, https://doi.org/10.1007/978-94-009-3173-2
. [all data]
Hunter and Lias, 1998
Hunter, E.P.; Lias, S.G.,
Evaluated Gas Phase Basicities and Proton Affinities of Molecules: An Update,
J. Phys. Chem. Ref. Data, 1998, 27, 3, 413-656, https://doi.org/10.1063/1.556018
. [all data]
Tarasenko, Tishenkov, et al., 1986
Tarasenko, N.A.; Tishenkov, A.A.; Zaikin, V.G.; Volkova, V.V.; Gusel'nikov, L.E.,
Adiabatic ionization energy of methylenimine,
Bull. Acad. Sci. USSR, Div. Chem. Sci., 1986, 10, 2196. [all data]
Aue and Bowers, 1979
Aue, D.H.; Bowers, M.T.,
Chapter 9. Stabilities of positive ions from equilibrium gas phase basicity measurements
in Ions Chemistry,, ed. M.T. Bowers, 1979. [all data]
Kiser and Gallegos, 1962
Kiser, R.W.; Gallegos, E.J.,
A technique for the rapid determination of ionization and appearance potentials,
J. Phys. Chem., 1962, 66, 947. [all data]
Gallegos and Kiser, 1962
Gallegos, E.J.; Kiser, R.W.,
Electron impact spectroscopy of the four- and five-membered, saturated heterocyclic compounds containing nitrogen, oxygen and sulfur,
J. Phys. Chem., 1962, 66, 136. [all data]
Yoshikawa, Hashimoto, et al., 1974
Yoshikawa, K.; Hashimoto, M.; Morishima, I.,
Photoelectron spectroscopic study of cyclic amines. The relation between ionization potentials, basicities, and s character of the nitrogen lone pair electrons,
J. Am. Chem. Soc., 1974, 96, 288. [all data]
Holmes, Lossing, et al., 1992
Holmes, J.L.; Lossing, F.P.; Mayer, P.M.,
Concerning the heats of formation of CH2NH and CH2NH+,
Chem. Phys. Lett., 1992, 198, 211. [all data]
Burgers, Holmes, et al., 1984
Burgers, P.C.; Holmes, J.L.; Terlouw, J.K.,
Gaseous [H2,C,N]+ and [H3,C,N]+ ions. Generation of formation, and dissociation characteristics of [H2CN]+, [HCNH]+, [CNH2]+, [H2CNH]+, and [HCN]+,
J. Am. Chem. Soc., 1984, 106, 2762. [all data]