2,3-Diazabutadiene
- Formula: C2H4N2
- Molecular weight: 56.0666
- IUPAC Standard InChIKey: NBHLEUNJGNIKRR-UHFFFAOYSA-N
- CAS Registry Number: 503-27-5
- Chemical structure:
View 3d structure (requires JavaScript / HTML 5) - Permanent link for this species. Use this link for bookmarking this species for future reference.

Gas phase ion energetics data

Data compiled as indicated in comments:
LBLHLM - Sharon G. Lias, John E. Bartmess, Joel F. Liebman, John L. Holmes, Rhoda D. Levin, and W. Gary Mallard
LLK - Sharon G. Lias, Rhoda D. Levin, and Sherif A. Kafafi
Ionization energy determinations
IE (eV) | Method | Reference | Comment |
---|---|---|---|
8.95 | PE | Zverev, Vovna, et al., 1975 | LLK |
9.55 | PE | Kirste, Poppek, et al., 1984 | Vertical value; LBLHLM |

References

Zverev, Vovna, et al., 1975
Zverev, V.V.; Vovna, V.I.; Kitaev, Yu.P.; Vilesov, F.I.,
Photoelectron spectrum and structure of formaldehyde azine,
J. Struct. Chem., 1975, 16, 947. [all data]
Kirste, Poppek, et al., 1984
Kirste, K.; Poppek, R.; Rademacher, P.,
Photoelektronenspektren und konformationsverhalten von azinen,
Chem. Ber., 1984, 117, 1061. [all data]