Acetonitrile, fluoro-
- Formula: C2H2FN
- Molecular weight: 59.0424
- IUPAC Standard InChIKey: GNFVFPBRMLIKIM-UHFFFAOYSA-N
- CAS Registry Number: 503-20-8
- Chemical structure:
View 3d structure (requires JavaScript / HTML 5) - Other names: Fluoroacetonitrile

Gas phase ion energetics data

Data compiled as indicated in comments:
B - John E. Bartmess
LBLHLM - Sharon G. Lias, John E. Bartmess, Joel F. Liebman, John L. Holmes, Rhoda D. Levin, and W. Gary Mallard
LLK - Sharon G. Lias, Rhoda D. Levin, and Sherif A. Kafafi
Ionization energy determinations
IE (eV) | Method | Reference | Comment |
---|---|---|---|
12.81 | PE | Molder, Pikver, et al., 1983 | Vertical value; LBLHLM |
12.67 | PE | Botter, Gounelle, et al., 1977 | Vertical value; LLK |
De-protonation reactions
C2HFN- + =
By formula: C2HFN- + H+ = C2H2FN
Quantity | Value | Units | Method | Reference | Comment |
---|---|---|---|---|---|
ΔrH° | 1544. ± 8.8 | kJ/mol | G+TS | Taft, 1987 | gas phase; value altered from reference due to change in acidity scale; B |
Quantity | Value | Units | Method | Reference | Comment |
ΔrG° | 1513. ± 8.4 | kJ/mol | IMRE | Taft, 1987 | gas phase; value altered from reference due to change in acidity scale; B |

Reaction thermochemistry data

Data compiled by: John E. Bartmess
Individual Reactions
C2HFN- + =
By formula: C2HFN- + H+ = C2H2FN
Quantity | Value | Units | Method | Reference | Comment |
---|---|---|---|---|---|
ΔrH° | 1544. ± 8.8 | kJ/mol | G+TS | Taft, 1987 | gas phase; value altered from reference due to change in acidity scale |
Quantity | Value | Units | Method | Reference | Comment |
ΔrG° | 1513. ± 8.4 | kJ/mol | IMRE | Taft, 1987 | gas phase; value altered from reference due to change in acidity scale |

Phase change data

Data compiled as indicated in comments:
BS - Robert L. Brown and Stephen E. Stein
AC - William E. Acree, Jr., James S. Chickos
Quantity | Value | Units | Method | Reference | Comment |
---|---|---|---|---|---|
Tboil | 352.7 | K | N/A | Aldrich Chemical Company Inc., 1990 | BS |
Enthalpy of vaporization
ΔvapH (kcal/mol) | Temperature (K) | Method | Reference | Comment |
---|---|---|---|---|
9.11 | 288. | A,GS | Stephenson and Malanowski, 1987 | Based on data from 273. to 333. K. See also Redemann, Chaikin, et al., 1948 and Dykyj, 1970.; AC |

References

Molder, Pikver, et al., 1983
Molder, U.H.; Pikver, R.J.; Koppel, I.A.,
Photoelectron spectra of molecules. 3. Nitriles,
Org. React. Tartu, 1983, 20, 230. [all data]
Botter, Gounelle, et al., 1977
Botter, R.; Gounelle, Y.; Henry, Y.; Jullien, J.; Menes, F.; Solgadi, D.,
Photoelectron spectra of halogeno-3-propynes (XCH2≡CH) and halogeno- methylcyanides (XCH2C≡N) and comments on the attribution of fluorine IP,
J. Electron Spectrosc. Relat. Phenom., 1977, 10, 393. [all data]
Taft, 1987
Taft, R.W.,
The Nature and Analysis of Substitutent Electronic Effects,
Personal communication. See also Prog. Phys. Org. Chem., 1987, 16, 1. [all data]