2-Butyne
- Formula: C4H6
- Molecular weight: 54.0904
- IUPAC Standard InChIKey: XNMQEEKYCVKGBD-UHFFFAOYSA-N
- CAS Registry Number: 503-17-3
- Chemical structure:
View 3d structure (requires JavaScript / HTML 5) - Other names: But-2-yne; Dimethylacetylene; CH3C≡CCH3; Crotonylene; UN 1144

Gas phase thermochemistry data

Data compiled as indicated in comments:
ALS - Hussein Y. Afeefy, Joel F. Liebman, and Stephen E. Stein
GT - Glushko Thermocenter, Russian Academy of Sciences, Moscow
Quantity | Value | Units | Method | Reference | Comment |
---|---|---|---|---|---|
ΔfH°gas | 145.1 ± 1.0 | kJ/mol | Cm | Prosen, Maron, et al., 1951 | ALS |
ΔfH°gas | 148.0 ± 1.5 | kJ/mol | Ccb | Wagman, Kilpatrick, et al., 1945 | Unpublished work of E. J. Prosen; ALS |
Quantity | Value | Units | Method | Reference | Comment |
ΔcH°gas | -2576.7 ± 0.96 | kJ/mol | Cm | Prosen, Maron, et al., 1951 | Corresponding ΔfHºgas = 145.1 kJ/mol (simple calculation by NIST; no Washburn corrections); ALS |
Constant pressure heat capacity of gas
Cp,gas (J/mol*K) | Temperature (K) | Reference | Comment |
---|---|---|---|
39.18 | 50. | Thermodynamics Research Center, 1997 | p=1 bar. Selected values are in close agreement with other statistically calculated values [ Wagman D.D., 1945].; GT |
48.43 | 100. | ||
56.69 | 150. | ||
63.57 | 200. | ||
74.10 | 273.15 | ||
78.02 | 298.15 | ||
78.32 | 300. | ||
94.73 | 400. | ||
110.38 | 500. | ||
124.30 | 600. | ||
136.49 | 700. | ||
147.14 | 800. | ||
156.45 | 900. | ||
164.55 | 1000. | ||
171.59 | 1100. | ||
177.71 | 1200. | ||
183.0 | 1300. | ||
187.6 | 1400. | ||
191.7 | 1500. |
Constant pressure heat capacity of gas
Cp,gas (J/mol*K) | Temperature (K) | Reference | Comment |
---|---|---|---|
84.56 | 336.07 | Kistiakowsky G.B., 1940 | GT |
89.66 | 369.46 |

Condensed phase thermochemistry data

Data compiled by: Eugene S. Domalski and Elizabeth D. Hearing
Quantity | Value | Units | Method | Reference | Comment |
---|---|---|---|---|---|
S°liquid | 195.10 | J/mol*K | N/A | Yost, Osborne, et al., 1941 | Extrapolated from 291.0 K. Anomalous heat capacity between 145 and 160 K. S obtained from total energy divided by average temperature. |
Constant pressure heat capacity of liquid
Cp,liquid (J/mol*K) | Temperature (K) | Reference | Comment |
---|---|---|---|
124.14 | 290. | Yost, Osborne, et al., 1941 | T = 15 to 290 K. |

Phase change data

Data compiled as indicated in comments:
BS - Robert L. Brown and Stephen E. Stein
TRC - Thermodynamics Research Center, NIST Boulder Laboratories, Chris Muzny director
AC - William E. Acree, Jr., James S. Chickos
DH - Eugene S. Domalski and Elizabeth D. Hearing
ALS - Hussein Y. Afeefy, Joel F. Liebman, and Stephen E. Stein
Quantity | Value | Units | Method | Reference | Comment |
---|---|---|---|---|---|
Tboil | 300. ± 1. | K | AVG | N/A | Average of 23 values; Individual data points |
Quantity | Value | Units | Method | Reference | Comment |
Tfus | 240.82 | K | N/A | Pomerantz, Fookson, et al., 1954 | Uncertainty assigned by TRC = 0.2 K; TRC |
Tfus | 240.9 | K | N/A | Boord, Greenlee, et al., 1946 | Uncertainty assigned by TRC = 0.2 K; TRC |
Tfus | 240.63 | K | N/A | Boord, Greenlee, et al., 1946 | Uncertainty assigned by TRC = 0.3 K; TRC |
Tfus | 240.83 | K | N/A | Henne and Greenlee, 1945 | Uncertainty assigned by TRC = 0.1 K; TRC |
Tfus | 240.5 | K | N/A | Heisig and Davis, 1935 | Uncertainty assigned by TRC = 0.3 K; TRC |
Quantity | Value | Units | Method | Reference | Comment |
Ttriple | 240.8 | K | N/A | Yost, Osborne, et al., 1941, 2 | Uncertainty assigned by TRC = 0.15 K; TRC |
Ttriple | 240.93 | K | N/A | Yost, Osborne, et al., 1941, 2 | Uncertainty assigned by TRC = 0.06 K; TRC |
Quantity | Value | Units | Method | Reference | Comment |
ΔvapH° | 26.7 | kJ/mol | N/A | Reid, 1972 | AC |
Enthalpy of vaporization
ΔvapH (kJ/mol) | Temperature (K) | Method | Reference | Comment |
---|---|---|---|---|
26.945 | 291.0 | N/A | Yost, Osborne, et al., 1941 | P = 71.46 kPa; DH |
26.945 | 291.00 | N/A | Osborne, Garner, et al., 1940 | DH |
29. | 255. | A | Stephenson and Malanowski, 1987 | Based on data from 240. to 308. K.; AC |
26.9 ± 0.3 | 291.00 | C | Yost, Osborne, et al., 1941, 3 | ALS |
26.9 ± 0.1 | 291. | C | Yost, Osborne, et al., 1941 | AC |
Entropy of vaporization
ΔvapS (J/mol*K) | Temperature (K) | Reference | Comment |
---|---|---|---|
92.59 | 291.0 | Yost, Osborne, et al., 1941 | P; DH |
92.59 | 291.00 | Osborne, Garner, et al., 1940 | DH |
Enthalpy of sublimation
ΔsubH (kJ/mol) | Temperature (K) | Method | Reference | Comment |
---|---|---|---|---|
37.4 | 220. | A | Stull, 1947 | Based on data from 200. to 239. K.; AC |
Enthalpy of fusion
ΔfusH (kJ/mol) | Temperature (K) | Reference | Comment |
---|---|---|---|
9.2349 | 240.92 | Yost, Osborne, et al., 1941 | DH |
9.2328 | 240.93 | Osborne, Garner, et al., 1940 | DH |
9.25 | 240.9 | Acree, 1991 | AC |
Entropy of fusion
ΔfusS (J/mol*K) | Temperature (K) | Reference | Comment |
---|---|---|---|
38.348 | 240.92 | Yost, Osborne, et al., 1941 | DH |
38.33 | 240.93 | Osborne, Garner, et al., 1940 | DH |

Reaction thermochemistry data

Data compiled as indicated in comments:
B - John E. Bartmess
ALS - Hussein Y. Afeefy, Joel F. Liebman, and Stephen E. Stein
Individual Reactions
C4H5- + =
Quantity | Value | Units | Method | Reference | Comment |
---|---|---|---|---|---|
ΔrH° | 1628. ± 8.8 | kJ/mol | G+TS | Gal, Decouzon, et al., 2001 | gas phase; Acid: MeC≡CMe; B |
ΔrH° | 1628. ± 14. | kJ/mol | G+TS | N/A | gas phase; Measured vs pyridine; B |
Quantity | Value | Units | Method | Reference | Comment |
ΔrG° | 1597. ± 8.4 | kJ/mol | IMRE | Gal, Decouzon, et al., 2001 | gas phase; Acid: MeC≡CMe; B |
ΔrG° | 1596. ± 13. | kJ/mol | IMRE | N/A | gas phase; Measured vs pyridine; B |
By formula: 2H2 + C4H6 = C4H10
Quantity | Value | Units | Method | Reference | Comment |
---|---|---|---|---|---|
ΔrH° | -272.4 ± 1.3 | kJ/mol | Chyd | Conn, Kistiakowsky, et al., 1939 | gas phase; Reanalyzed by Cox and Pilcher, 1970, Original value = -274.4 ± 0.54 kJ/mol; At 355 K; ALS |

Gas phase ion energetics data

Data evaluated as indicated in comments:
HL - Edward P. Hunter and Sharon G. Lias
L - Sharon G. Lias
Data compiled as indicated in comments:
B - John E. Bartmess
LLK - Sharon G. Lias, Rhoda D. Levin, and Sherif A. Kafafi
RDSH - Henry M. Rosenstock, Keith Draxl, Bruce W. Steiner, and John T. Herron
Quantity | Value | Units | Method | Reference | Comment |
---|---|---|---|---|---|
IE (evaluated) | 9.58 ± 0.02 | eV | N/A | N/A | L |
Quantity | Value | Units | Method | Reference | Comment |
Proton affinity (review) | 775.8 | kJ/mol | N/A | Hunter and Lias, 1998 | HL |
Quantity | Value | Units | Method | Reference | Comment |
Gas basicity | 745.1 | kJ/mol | N/A | Hunter and Lias, 1998 | HL |
Ionization energy determinations
IE (eV) | Method | Reference | Comment |
---|---|---|---|
9.59 ± 0.02 | PE | Bieri, Burger, et al., 1977 | LLK |
9.562 ± 0.005 | PE | Carlier, Dubois, et al., 1975 | LLK |
9.61 | PE | Ensslin, Bock, et al., 1974 | LLK |
9.59 | PE | Brogli, Heilbronner, et al., 1973 | LLK |
9.56 | EI | Lossing, 1972 | LLK |
9.79 | PE | Bieri and Asbrink, 1980 | Vertical value; LLK |
Appearance energy determinations
Ion | AE (eV) | Other Products | Method | Reference | Comment |
---|---|---|---|---|---|
CH3+ | 17.6 ± 0.5 | ? | EI | Coats and Anderson, 1957 | RDSH |
C2H3+ | 14.7 ± 0.2 | ? | EI | Coats and Anderson, 1957 | RDSH |
C3H3+ | 11.04 | CH3 | EI | Lossing, 1972 | LLK |
C4H2+ | 16.7 ± 0.3 | ? | EI | Coats and Anderson, 1957 | RDSH |
C4H3+ | 15.1 ± 0.2 | H2+H | EI | Coats and Anderson, 1957 | RDSH |
C4H4+ | 14.0 ± 0.1 | H2 | EI | Coats and Anderson, 1957 | RDSH |
C4H5+ | 12.1 ± 0.1 | H | EI | Coats and Anderson, 1957 | RDSH |
De-protonation reactions
C4H5- + =
Quantity | Value | Units | Method | Reference | Comment |
---|---|---|---|---|---|
ΔrH° | 1628. ± 8.8 | kJ/mol | G+TS | Gal, Decouzon, et al., 2001 | gas phase; Acid: MeC≡CMe; B |
ΔrH° | 1628. ± 14. | kJ/mol | G+TS | N/A | gas phase; Measured vs pyridine; B |
Quantity | Value | Units | Method | Reference | Comment |
ΔrG° | 1597. ± 8.4 | kJ/mol | IMRE | Gal, Decouzon, et al., 2001 | gas phase; Acid: MeC≡CMe; B |
ΔrG° | 1596. ± 13. | kJ/mol | IMRE | N/A | gas phase; Measured vs pyridine; B |

Vibrational and/or electronic energy levels

Data compiled by: Takehiko Shimanouchi
Symmetry: D'3h Symmetry Number σ = 6
Sym. | No | Approximate | Selected Freq. | Infrared | Raman | Comments | ||||
---|---|---|---|---|---|---|---|---|---|---|
Species | type of mode | Value | Rating | Value | Phase | Value | Phase | |||
a'1 | 1 | CH3 s-str | 2916 | C | ia | 2916 S p | liq. | Free rotation | ||
a'1 | 2 | C≡C str | 2240 | E | ia | 2310 S p | liq. | Free rotation, FR(2ν8) | ||
a'1 | 2 | C≡C str | 2240 | E | ia | 2233 S p | liq. | Free rotation, FR(2ν8) | ||
a'1 | 3 | CH3 s-deform | 1380 | C | ia | 1380 S | liq. | Free rotation | ||
a'1 | 4 | C-C str | 725 | E | ia | 774 M p | liq. | Free rotation, FR(2ν16) | ||
a'1 | 4 | C-C str | 725 | E | ia | 693 M p | liq. | Free rotation, FR(2ν16) | ||
a"1 | 5 | CH3 torsion | ia | ia | Free rotation | |||||
a"2 | 6 | CH3 s-str | 2938 | B | 2938 S | gas | ia | Free rotation | ||
a"2 | 7 | CH3 s-deform | 1382 | B | 1382 M | gas | ia | Free rotation | ||
a"2 | 8 | C-C str | 1152 | B | 1152 W | gas | ia | Free rotation | ||
e' | 9 | CH3 d-str | 2973 | B | 2973 S | gas | Free rotation | |||
e' | 10 | CH3 d-deform | 1456 | B | 1456 S | gas | Free rotation | |||
e' | 11 | CH3 rock | 1054 | B | 1054 M | gas | Free rotation | |||
e' | 12 | CCC deform | 213 | C | 213 VW | liq. | Free rotation | |||
e | 13 | CH3 d-str | 2966 | D | ia | 2966 W | liq. | Free rotation | ||
e | 14 | CH3 d-deform | 1448 | C | ia | 1448 M dp | liq. | Free rotation | ||
e | 15 | CH3 rock | 1029 | C | ia | 1029 M dp | liq. | Free rotation | ||
e | 16 | CCC deform | 371 | C | ia | 371 S dp | liq. | Free rotation | ||
Source: Shimanouchi, 1972

Kovats' RI, non-polar column, isothermal

Column type | Active phase | Temperature (C) | I | Reference | Comment |
---|---|---|---|---|---|
Packed | Squalane | 27. | 463. | Hively and Hinton, 1968 | He, Chromosorb P; Column length: 15. m; Column diameter: 0.25 mm |
Packed | Squalane | 49. | 463. | Hively and Hinton, 1968 | He, Chromosorb P; Column length: 15. m; Column diameter: 0.25 mm |
Packed | Squalane | 67. | 463. | Hively and Hinton, 1968 | He, Chromosorb P; Column length: 15. m; Column diameter: 0.25 mm |
Packed | Squalane | 86. | 462. | Hively and Hinton, 1968 | He, Chromosorb P; Column length: 15. m; Column diameter: 0.25 mm |
Packed | Squalane | 26. | 473. | Zulaïca and Guiochon, 1966 | Column length: 10. m |

Kovats' RI, non-polar column, custom temperature program

Column type | Active phase | I | Reference | Comment |
---|---|---|---|---|
Capillary | Petrocol DH-100 | 488. | Haagen-Smit Laboratory, 1997 | He; Column length: 100. m; Column diameter: 0.2 mm; Program: 5C(10min) => 5C/min => 50C(48min) => 1.5C/min => 195C(91min) |

Van Den Dool and Kratz RI, non-polar column, temperature ramp

Column type | Active phase | I | Reference | Comment |
---|---|---|---|---|
Capillary | Petrocol DH | 478. | White, Hackett, et al., 1992 | 100. m/0.25 mm/0.5 μm, He, 1. K/min; Tstart: 30. C; Tend: 220. C |

Normal alkane RI, non-polar column, temperature ramp

Column type | Active phase | I | Reference | Comment |
---|---|---|---|---|
Capillary | Polydimethyl siloxane: CP-Sil 5 CB | 485. | Bramston-Cook, 2013 | 60. m/0.25 mm/1.0 μm, Helium, 45. C @ 1.45 min, 3.6 K/min, 210. C @ 2.72 min |
Capillary | OV-101 | 466. | Zenkevich, 2005 | 25. m/0.20 mm/0.10 μm, N2/He, 6. K/min; Tstart: 50. C; Tend: 250. C |

Normal alkane RI, non-polar column, custom temperature program

Column type | Active phase | I | Reference | Comment |
---|---|---|---|---|
Capillary | CP-Sil5 CB MS | 482. | Tirillini, Verdelli, et al., 2000 | 50. m/0.32 mm/0.4 μm; Program: 0C (3min) => 3C/min => 50C => 5C/min => 220C (30min) |

References

Prosen, Maron, et al., 1951
Prosen, E.J.; Maron, F.W.; Rossini, F.D.,
Heats of combustion, formation, and insomerization of ten C4 hydrocarbons,
J. Res. NBS, 1951, 46, 106-112. [all data]
Wagman, Kilpatrick, et al., 1945
Wagman, D.D.; Kilpatrick, J.E.; Pitzer, K.S.; Rossini, F.D.,
Heats, equilibrium constants, and free energies of formation of the acetylene hydrocarbons through the pentynes, to 1,500° K,
J. Res. NBS, 1945, 35, 467-496. [all data]
Thermodynamics Research Center, 1997
Thermodynamics Research Center,
Selected Values of Properties of Chemical Compounds., Thermodynamics Research Center, Texas A&M University, College Station, Texas, 1997. [all data]
Wagman D.D., 1945
Wagman D.D.,
Heats, equilibrium constants, and free energies of formation of the acetylene hydrocarbons through the pentynes to 1500 K,
J. Res. Nat. Bur. Stand., 1945, 35, 467-496. [all data]
Kistiakowsky G.B., 1940
Kistiakowsky G.B.,
Gaseous heat capacities. III,
J. Chem. Phys., 1940, 8, 618-622. [all data]
Yost, Osborne, et al., 1941
Yost, D.M.; Osborne, D.W.; Garner, C.S.,
The heat capacity, entropy, and heats of transition, fusion, and vaporization of dimethylacetylene. Free rotation in the dimethylacetylene molecule,
J. Am. Chem. Soc., 1941, 63, 3492-3496. [all data]
Pomerantz, Fookson, et al., 1954
Pomerantz, P.; Fookson, A.; Mears, T.W.; Rothberg, S.; Howard, F.L.,
Synthesis and Physical Properties of Several Acetylenic Hydrocarbons,
J. Res. Natl. Bur. Stand. (U. S.), 1954, 52, 51. [all data]
Boord, Greenlee, et al., 1946
Boord, C.E.; Greenlee, K.W.; Perilstein, W.L.,
The Synthesis, Purification and Prop. of Hydrocarbons of Low Mol. Weight, Am. Pet. Inst. Res. Proj. 45, Eighth Annu. Rep., Ohio State Univ., June 30, 1946. [all data]
Henne and Greenlee, 1945
Henne, A.L.; Greenlee, K.W.,
Preparation and Physical Constants of Acetylenic Compounds,
J. Am. Chem. Soc., 1945, 67, 484-5. [all data]
Heisig and Davis, 1935
Heisig, G.B.; Davis, H.M.,
Physical Constants of Dimethylacetylene,
J. Am. Chem. Soc., 1935, 57, 339-40. [all data]
Yost, Osborne, et al., 1941, 2
Yost, D.M.; Osborne, D.W.; Garner, C.S.,
The Heat Capacity, Entropy, and Heats of Transition, Fusion, and Vaporization of Dimethylacetylene. Free Rotation in the Dimethylacetylene Molecule,
J. Am. Chem. Soc., 1941, 63, 3492. [all data]
Reid, 1972
Reid, Robert C.,
Handbook on vapor pressure and heats of vaporization of hydrocarbons and related compounds, R. C. Wilhort and B. J. Zwolinski, Texas A Research Foundation. College Station, Texas(1971). 329 pages.$10.00,
AIChE J., 1972, 18, 6, 1278-1278, https://doi.org/10.1002/aic.690180637
. [all data]
Osborne, Garner, et al., 1940
Osborne, D.W.; Garner, C.S.; Yost, D.M.,
The entropy of dimethylacetylene from low temperature calorimetric measurements. Free rotation in the dimethylacetylene molecule,
J. Chem. Phys., 1940, 8, 131. [all data]
Stephenson and Malanowski, 1987
Stephenson, Richard M.; Malanowski, Stanislaw,
Handbook of the Thermodynamics of Organic Compounds, 1987, https://doi.org/10.1007/978-94-009-3173-2
. [all data]
Yost, Osborne, et al., 1941, 3
Yost, D.M.; Osborne, D.W.; Garner, C.S.,
The heat capacity, entropy, and heats of transition, fusion, and vaporization of dimethylacetylene. Free rotation in the dimethylacetylene molecule,
J. Am. Chem. Soc., 1941, 63, 3492-34. [all data]
Stull, 1947
Stull, Daniel R.,
Vapor Pressure of Pure Substances. Organic and Inorganic Compounds,
Ind. Eng. Chem., 1947, 39, 4, 517-540, https://doi.org/10.1021/ie50448a022
. [all data]
Acree, 1991
Acree, William E.,
Thermodynamic properties of organic compounds: enthalpy of fusion and melting point temperature compilation,
Thermochimica Acta, 1991, 189, 1, 37-56, https://doi.org/10.1016/0040-6031(91)87098-H
. [all data]
Gal, Decouzon, et al., 2001
Gal, J.F.; Decouzon, M.; Maria, P.C.; Gonzalez, A.I.; Mo, O.; Yanez, M.; El Chaouch, S.; Guillemin, J.C.,
Acidity trends in alpha,beta-unsaturated alkanes, silanes, germanes, and stannanes,
J. Am. Chem. Soc., 2001, 123, 26, 6353-6359, https://doi.org/10.1021/ja004079j
. [all data]
Conn, Kistiakowsky, et al., 1939
Conn, J.B.; Kistiakowsky, G.B.; Smith, E.A.,
Heats of organic reactions. VIII. Some further hydrogenations, including those of some acetylenes,
J. Am. Chem. Soc., 1939, 61, 1868-1876. [all data]
Cox and Pilcher, 1970
Cox, J.D.; Pilcher, G.,
Thermochemistry of Organic and Organometallic Compounds, Academic Press, New York, 1970, 1-636. [all data]
Hunter and Lias, 1998
Hunter, E.P.; Lias, S.G.,
Evaluated Gas Phase Basicities and Proton Affinities of Molecules: An Update,
J. Phys. Chem. Ref. Data, 1998, 27, 3, 413-656, https://doi.org/10.1063/1.556018
. [all data]
Bieri, Burger, et al., 1977
Bieri, G.; Burger, F.; Heilbronner, E.; Maier, J.P.,
Valence ionization enrgies of hydrocarbons,
Helv. Chim. Acta, 1977, 60, 2213. [all data]
Carlier, Dubois, et al., 1975
Carlier, P.; Dubois, J.E.; Masclet, P.; Mouvier, G.,
Spectres de photoelectrons des alcynes,
J. Electron Spectrosc. Relat. Phenom., 1975, 7, 55. [all data]
Ensslin, Bock, et al., 1974
Ensslin, W.; Bock, H.; Becker, G.,
Photoelectron spectra and molecular properties. XXX. π interactions in H3Si- H3C-substituted acetylenes,
J. Am. Chem. Soc., 1974, 96, 2757. [all data]
Brogli, Heilbronner, et al., 1973
Brogli, F.; Heilbronner, E.; Hornung, V.; Kloster-Jensen, E.,
230. Die photoelektronen-spektren methyl-substituierter Acetylene,
Helv. Chim. Acta, 1973, 56, 2171. [all data]
Lossing, 1972
Lossing, F.P.,
Free radicals by mass spectrometry. XLV. Ionization potentials and heats of formation of C3H3, C3H5, and C4H7 radicals and ions,
Can. J. Chem., 1972, 50, 3973. [all data]
Bieri and Asbrink, 1980
Bieri, G.; Asbrink, L.,
30.4-nm He(II) photoelectron spectra of organic molecules,
J. Electron Spectrosc. Relat. Phenom., 1980, 20, 149. [all data]
Coats and Anderson, 1957
Coats, F.H.; Anderson, R.C.,
Thermodynamic data from electron-impact measurements on acetylene and substituted acetylenes,
J. Am. Chem. Soc., 1957, 79, 1340. [all data]
Shimanouchi, 1972
Shimanouchi, T.,
Tables of Molecular Vibrational Frequencies Consolidated Volume I, National Bureau of Standards, 1972, 1-160. [all data]