5-Nonanone
- Formula: C9H18O
- Molecular weight: 142.2386
- IUPAC Standard InChIKey: WSGCRAOTEDLMFQ-UHFFFAOYSA-N
- CAS Registry Number: 502-56-7
- Chemical structure:
View 3d structure (requires JavaScript / HTML 5) - Other names: Butyl ketone; Dibutyl ketone; Nonan-5-one; (n-C4H9)2CO; di-n-Butylketone; 5-Oxononane

Gas phase thermochemistry data

Data compiled by: Hussein Y. Afeefy, Joel F. Liebman, and Stephen E. Stein
Quantity | Value | Units | Method | Reference | Comment |
---|---|---|---|---|---|
ΔfH°gas | -82.44 ± 0.32 | kcal/mol | Ccb | Harrop, Head, et al., 1970 | ht. of vaporization was from a private communication |

Condensed phase thermochemistry data

Data compiled as indicated in comments:
ALS - Hussein Y. Afeefy, Joel F. Liebman, and Stephen E. Stein
DH - Eugene S. Domalski and Elizabeth D. Hearing
Quantity | Value | Units | Method | Reference | Comment |
---|---|---|---|---|---|
ΔfH°liquid | -95.18 ± 0.32 | kcal/mol | Ccb | Harrop, Head, et al., 1970 | ht. of vaporization was from a private communication; ALS |
Quantity | Value | Units | Method | Reference | Comment |
ΔcH°liquid | -1366.11 ± 0.29 | kcal/mol | Ccb | Harrop, Head, et al., 1970 | ht. of vaporization was from a private communication; Corresponding ΔfHºliquid = -95.184 kcal/mol (simple calculation by NIST; no Washburn corrections); ALS |
Quantity | Value | Units | Method | Reference | Comment |
S°liquid | 95.94 | cal/mol*K | N/A | Andon, Counsell, et al., 1970 | DH |
Constant pressure heat capacity of liquid
Cp,liquid (cal/mol*K) | Temperature (K) | Reference | Comment |
---|---|---|---|
73.21 | 298.15 | Saluja, Peacock, et al., 1979 | DH |
72.56 | 298.15 | Andon, Counsell, et al., 1970 | T = 10 to 320 K.; DH |
72.42 | 298.15 | Harrop, Head, et al., 1970 | DH |

Phase change data

Data compiled as indicated in comments:
BS - Robert L. Brown and Stephen E. Stein
TRC - Thermodynamics Research Center, NIST Boulder Laboratories, Chris Muzny director
AC - William E. Acree, Jr., James S. Chickos
ALS - Hussein Y. Afeefy, Joel F. Liebman, and Stephen E. Stein
DH - Eugene S. Domalski and Elizabeth D. Hearing
Quantity | Value | Units | Method | Reference | Comment |
---|---|---|---|---|---|
Tboil | 460. ± 4. | K | AVG | N/A | Average of 9 values; Individual data points |
Quantity | Value | Units | Method | Reference | Comment |
Tfus | 267.3 | K | N/A | Timmermans, 1927 | Uncertainty assigned by TRC = 1.5 K; TRC |
Tfus | 268.35 | K | N/A | Bourgou, 1924 | Uncertainty assigned by TRC = 1.5 K; TRC |
Quantity | Value | Units | Method | Reference | Comment |
Ttriple | 269.31 | K | N/A | Andon, Counsell, et al., 1970, 2 | Crystal phase 1 phase; Uncertainty assigned by TRC = 0.05 K; TRC |
Quantity | Value | Units | Method | Reference | Comment |
Tc | 641.4 | K | N/A | Pulliam, Gude, et al., 1994 | Uncertainty assigned by TRC = 0.3 K; by the sealed ampule method; TRC |
Tc | 640. | K | N/A | Ambrose, Broderick, et al., 1974 | Uncertainty assigned by TRC = 4. K; TRC |
Quantity | Value | Units | Method | Reference | Comment |
ρc | 1.79 | mol/l | N/A | Pulliam, Gude, et al., 1994 | Uncertainty assigned by TRC = 0.02 mol/l; TRC |
Quantity | Value | Units | Method | Reference | Comment |
ΔvapH° | 9.61 | kcal/mol | A | Stephenson and Malanowski, 1987 | Based on data from 283. to 323. K. See also Rintelen, Saylor, et al., 1937.; AC |
ΔvapH° | 13.1 ± 0.1 | kcal/mol | GCC | Saluja, Peacock, et al., 1979 | AC |
ΔvapH° | 13.1 | kcal/mol | N/A | Ambrose, Ellender, et al., 1975 | AC |
ΔvapH° | 12.74 ± 0.02 | kcal/mol | V | Harrop, Head, et al., 1970 | ht. of vaporization was from a private communication; ALS |
ΔvapH° | 12.7 ± 0.02 | kcal/mol | C | Harrop, Head, et al., 1970 | AC |
Reduced pressure boiling point
Tboil (K) | Pressure (atm) | Reference | Comment |
---|---|---|---|
361.2 | 0.029 | Weast and Grasselli, 1989 | BS |
Enthalpy of vaporization
ΔvapH (kcal/mol) | Temperature (K) | Method | Reference | Comment |
---|---|---|---|---|
10.7 | 458. | A | Stephenson and Malanowski, 1987 | Based on data from 443. to 486. K.; AC |
11.9 | 372. | A | Stephenson and Malanowski, 1987 | Based on data from 357. to 468. K. See also Ambrose, Ellender, et al., 1975.; AC |
Enthalpy of fusion
ΔfusH (kcal/mol) | Temperature (K) | Reference | Comment |
---|---|---|---|
2.694 | 451.8 | Acree, 1991 | AC |
Enthalpy of phase transition
ΔHtrs (kcal/mol) | Temperature (K) | Initial Phase | Final Phase | Reference | Comment |
---|---|---|---|---|---|
0.0891 | 110. | crystaline, II | crystaline, I | Andon, Counsell, et al., 1970 | DH |
5.9584 | 269.31 | crystaline, I | liquid | Andon, Counsell, et al., 1970 | DH |
Entropy of phase transition
ΔStrs (cal/mol*K) | Temperature (K) | Initial Phase | Final Phase | Reference | Comment |
---|---|---|---|---|---|
0.810 | 110. | crystaline, II | crystaline, I | Andon, Counsell, et al., 1970 | DH |
22.12 | 269.31 | crystaline, I | liquid | Andon, Counsell, et al., 1970 | DH |

Gas phase ion energetics data

Data evaluated as indicated in comments:
HL - Edward P. Hunter and Sharon G. Lias
Data compiled as indicated in comments:
LLK - Sharon G. Lias, Rhoda D. Levin, and Sherif A. Kafafi
RDSH - Henry M. Rosenstock, Keith Draxl, Bruce W. Steiner, and John T. Herron
Quantity | Value | Units | Method | Reference | Comment |
---|---|---|---|---|---|
Proton affinity (review) | 204.0 | kcal/mol | N/A | Hunter and Lias, 1998 | HL |
Quantity | Value | Units | Method | Reference | Comment |
Gas basicity | 196.4 | kcal/mol | N/A | Hunter and Lias, 1998 | HL |
Ionization energy determinations
IE (eV) | Method | Reference | Comment |
---|---|---|---|
9.07 | EI | Holmes, Fingas, et al., 1981 | LLK |
9.71 | EI | Potzinger and Bunau, 1969 | RDSH |
Appearance energy determinations
Ion | AE (eV) | Other Products | Method | Reference | Comment |
---|---|---|---|---|---|
C4H9+ | 11.82 | ? | EI | Potzinger and Bunau, 1969 | RDSH |
C5H9O+ | 10.86 | ? | EI | Potzinger and Bunau, 1969 | RDSH |

Kovats' RI, non-polar column, isothermal

View large format table.

Column type Active phase Temperature (C) I Reference Comment
CapillaryHP-1110.1055.Héberger and Görgényi, 199950. m/0.32 mm/1.05 μm, N2
CapillaryHP-150.1051.Héberger and Görgényi, 199950. m/0.32 mm/1.05 μm, N2
CapillaryHP-170.1052.Héberger and Görgényi, 199950. m/0.32 mm/1.05 μm, N2
CapillaryHP-190.1054.Héberger and Görgényi, 199950. m/0.32 mm/1.05 μm, N2
CapillarySE-30100.1059.Golovnya, Syomina, et al., 199725. m/0.32 mm/1. μm, He
CapillarySE-30110.1059.Golovnya, Syomina, et al., 199725. m/0.32 mm/1. μm, He
CapillarySE-3080.1060.Golovnya, Syomina, et al., 199725. m/0.32 mm/1. μm, He
CapillarySE-3090.1060.Golovnya, Syomina, et al., 199725. m/0.32 mm/1. μm, He
PackedApiezon L120.1038.Bogoslovsky, Anvaer, et al., 1978Celite 545
PackedApiezon L160.1052.Bogoslovsky, Anvaer, et al., 1978Celite 545
PackedApiezon L130.1035.Wehrli and Kováts, 1959Celite; Column length: 2.25 m
PackedApiezon L190.1039.Wehrli and Kováts, 1959Celite; Column length: 2.25 m

Kovats' RI, polar column, isothermal

View large format table.

Column type Active phase Temperature (C) I Reference Comment
CapillaryHP-Innowax110.1353.9Héberger and Görgényi, 199930. m/0.32 mm/0.5 μm
CapillaryHP-Innowax50.1334.1Héberger and Görgényi, 199930. m/0.32 mm/0.5 μm
CapillaryHP-Innowax70.1340.6Héberger and Görgényi, 199930. m/0.32 mm/0.5 μm
CapillaryHP-Innowax90.1347.3Héberger and Görgényi, 199930. m/0.32 mm/0.5 μm
CapillaryPEG-20M80.1309.9Orav, Kuningas, et al., 199450. m/0.2 mm/0.13 μm, He
CapillaryPEG-20M80.1321.0Orav, Kuningas, et al., 199450. m/0.2 mm/0.19 μm, He
CapillaryPEG-20M80.1325.6Orav, Kuningas, et al., 199450. m/0.2 mm/0.22 μm, He

Van Den Dool and Kratz RI, non-polar column, temperature ramp

View large format table.

Column type Active phase I Reference Comment
CapillarySPB-51073.Engel and Ratel, 200760. m/0.32 mm/1. μm, 40. C @ 2. min, 3. K/min, 230. C @ 10. min
CapillaryDB-11051.4Sun and Stremple, 200330. m/0.25 mm/0.25 μm, He, 3. K/min; Tstart: 40. C; Tend: 325. C
CapillaryUltra-21075.3Akporhonor, le Vent, et al., 199025. m/0.2 mm/0.33 μm, N2, 15. K/min; Tstart: 60.01 C
CapillaryUltra-21073.1Akporhonor, le Vent, et al., 199025. m/0.2 mm/0.33 μm, N2, 2. K/min; Tstart: 60.01 C
CapillaryUltra-21074.5Akporhonor, le Vent, et al., 199025. m/0.2 mm/0.33 μm, N2, 7. K/min; Tstart: 60.01 C
CapillaryUltra-21077.6Akporhonor, le Vent, et al., 199025. m/0.2 mm/0.33 μm, N2, 15. K/min; Tstart: 120.01 C
CapillaryUltra-21076.2Akporhonor, le Vent, et al., 199025. m/0.2 mm/0.33 μm, N2, 2. K/min; Tstart: 120.01 C
CapillaryUltra-21076.9Akporhonor, le Vent, et al., 199025. m/0.2 mm/0.33 μm, N2, 7. K/min; Tstart: 120.01 C

Normal alkane RI, non-polar column, isothermal

View large format table.

Column type Active phase Temperature (C) I Reference Comment
CapillaryOV-160.1051.Amboni, Junkes, et al., 2002
CapillarySE-3090.1057.Berezkin and Korolev, 1985Helium; Column length: 25. m; Column diameter: 0.32 mm
CapillarySE-3090.1064.Berezkin and Korolev, 1985Helium; Column length: 25. m; Column diameter: 0.32 mm
CapillarySE-3090.1066.Berezkin and Korolev, 1985Helium; Column length: 25. m; Column diameter: 0.32 mm
CapillarySE-3090.1070.Berezkin and Korolev, 1985Helium; Column length: 25. m; Column diameter: 0.32 mm
CapillarySE-3090.1076.Berezkin and Korolev, 1985Helium; Column length: 25. m; Column diameter: 0.32 mm
CapillarySE-3090.1082.Berezkin and Korolev, 1985Helium; Column length: 25. m; Column diameter: 0.32 mm

Normal alkane RI, non-polar column, temperature ramp

View large format table.

Column type Active phase I Reference Comment
CapillaryOV-1011060.Zenkevich, Eliseenkov, et al., 201125. m/0.20 mm/0.25 μm, Nitrogen, 6. K/min; Tstart: 40. C; Tend: 240. C
CapillaryOV-1011073.Menon, Chacko, et al., 1999N2, 1. K/min, 200. C @ 20. min; Column length: 50. m; Column diameter: 0.2 mm; Tstart: 80. C
CapillaryOV-1011074.Anker, Jurs, et al., 19902. K/min; Column length: 50. m; Column diameter: 0.28 mm; Tstart: 80. C; Tend: 200. C
CapillaryOV-11053.Schreyen, Dirinck, et al., 1979N2, 1. K/min; Column length: 183. m; Column diameter: 0.762 mm; Tstart: 0. C; Tend: 230. C

Normal alkane RI, non-polar column, custom temperature program

View large format table.

Column type Active phase I Reference Comment
CapillaryHP-11051.Junkes, Amboni, et al., 2004Program: not specified
CapillarySE-301058.Vinogradov, 2004Program: not specified
CapillarySE-301074.Vinogradov, 2004Program: not specified
CapillaryPolydimethyl siloxane1051.Junkes, Castanho, et al., 2003Program: not specified
CapillaryOV-1011054.Zenkevich and Malamakhov, 1987He; Column length: 50. m; Column diameter: 0.24 mm; Program: not specified
CapillaryOV-11074.Ramsey and Flanagan, 1982Program: not specified

Normal alkane RI, polar column, temperature ramp

View large format table.

Column type Active phase I Reference Comment
CapillaryCarbowax1360.Menon, Chacko, et al., 1999N2, 1. K/min, 200. C @ 20. min; Column length: 50. m; Column diameter: 0.2 mm; Tstart: 80. C
CapillaryCarbowax 20M1360.Anker, Jurs, et al., 19902. K/min; Column length: 80. m; Column diameter: 0.2 mm; Tstart: 70. C; Tend: 170. C

Normal alkane RI, polar column, custom temperature program

View large format table.

Column type Active phase I Reference Comment
CapillaryInnowax1334.Junkes, Amboni, et al., 2004Program: not specified
CapillaryCarbowax 20M1330.Vinogradov, 2004Program: not specified
CapillaryCarbowax 20M1360.Vinogradov, 2004Program: not specified
CapillaryDB-Wax1325.Peng, Yang, et al., 1991Program: not specified
CapillaryCarbowax 20M1330.Ramsey and Flanagan, 1982Program: not specified

References

Harrop, Head, et al., 1970
Harrop, D.; Head, A.J.; Lewis, G.B.,
Thermodynamic properties of organic oxygen compounds. 22. Enthalpies of combustion of some aliphatic ketones,
J. Chem. Thermodyn., 1970, 2, 203-210. [all data]
Andon, Counsell, et al., 1970
Andon, R.J.L.; Counsell, J.F.; Lees, E.B.; Martin, J.F.,
Thermodynamic properties of organic oxygen compounds. Part XXIII. Low-temperature heat capacity and entropy of C6, C7,
and C9 ketones, 1970, J. [all data]
Saluja, Peacock, et al., 1979
Saluja, P.P.S.; Peacock, L.A.; Fuchs, R.,
Enthalpies of interaction of aliphatic ketones with polar and nonpolar solvents,
J. Am. Chem. Soc., 1979, 101, 1958-1962. [all data]
Timmermans, 1927
Timmermans, J.,
The Melting Point of Organic Substances,
Bull. Soc. Chim. Belg., 1927, 36, 502. [all data]
Bourgou, 1924
Bourgou, A.,
Contribution a l'Etude du Methylal comme Solvant,
Bull. Soc. Chim. Belg., 1924, 33, 101-115. [all data]
Andon, Counsell, et al., 1970, 2
Andon, R.J.L.; Counsell, J.F.; Lees, E.B.; Martin, J.F.,
Thermodynamic Properties of Organic Oxygen Compounds Part XXIII. Low- temperature Heat Capacity and Entropy of C6, C7, and C9 Ketones,
J. Chem. Soc. A, 1970, 1970, 833. [all data]
Pulliam, Gude, et al., 1994
Pulliam, M.K.; Gude, M.T.; Teja, A.S.,
The Critical Properties of Twelve Isomeric n-Alkanones with Six to Nine Carbon Atoms,
Experimental Results for DIPPR 1990-91 Projects on Phase Equilibria and Pure Component Properties, 1994, 1994, DIPPR Data Ser. No. 2, p. 184-87. [all data]
Ambrose, Broderick, et al., 1974
Ambrose, D.; Broderick, B.E.; Townsend, R.,
The Critical Temperatures and Pressures of Thirty Organic Compounds,
J. Appl. Chem. Biotechnol., 1974, 24, 359. [all data]
Stephenson and Malanowski, 1987
Stephenson, Richard M.; Malanowski, Stanislaw,
Handbook of the Thermodynamics of Organic Compounds, 1987, https://doi.org/10.1007/978-94-009-3173-2
. [all data]
Rintelen, Saylor, et al., 1937
Rintelen, J.C.; Saylor, J.H.; Gross, P.M.,
The Densities and Vapor Pressures of Some Alkylbenzenes, Aliphatic Ketones and n-Amyl Chloride 1,
J. Am. Chem. Soc., 1937, 59, 6, 1129-1130, https://doi.org/10.1021/ja01285a050
. [all data]
Ambrose, Ellender, et al., 1975
Ambrose, D.; Ellender, J.H.; Lees, E.B.; Sprake, C.H.S.; Townsend, R.,
Thermodynamic properties of organic oxygen compounds XXXVIII. Vapour pressures of some aliphatic ketones,
The Journal of Chemical Thermodynamics, 1975, 7, 5, 453-472, https://doi.org/10.1016/0021-9614(75)90275-X
. [all data]
Weast and Grasselli, 1989
CRC Handbook of Data on Organic Compounds, 2nd Editon, Weast,R.C and Grasselli, J.G., ed(s)., CRC Press, Inc., Boca Raton, FL, 1989, 1. [all data]
Acree, 1991
Acree, William E.,
Thermodynamic properties of organic compounds: enthalpy of fusion and melting point temperature compilation,
Thermochimica Acta, 1991, 189, 1, 37-56, https://doi.org/10.1016/0040-6031(91)87098-H
. [all data]
Hunter and Lias, 1998
Hunter, E.P.; Lias, S.G.,
Evaluated Gas Phase Basicities and Proton Affinities of Molecules: An Update,
J. Phys. Chem. Ref. Data, 1998, 27, 3, 413-656, https://doi.org/10.1063/1.556018
. [all data]
Holmes, Fingas, et al., 1981
Holmes, J.L.; Fingas, M.; Lossing, F.P.,
Towards a general scheme for estimating the heats of formation of organic ions in the gas phase. Part I. Odd-electron cations,
Can. J. Chem., 1981, 59, 80. [all data]
Potzinger and Bunau, 1969
Potzinger, P.; Bunau, G.v.,
Empirische Beruksichtigung von Uberschussenergien bei der Auftrittspotentialbestimmung,
Ber. Bunsen-Ges. Phys. Chem., 1969, 73, 466. [all data]