Hydrocinnamic acid
- Formula: C9H10O2
- Molecular weight: 150.1745
- IUPAC Standard InChIKey: XMIIGOLPHOKFCH-UHFFFAOYSA-N
- CAS Registry Number: 501-52-0
- Chemical structure:
View 3d structure (requires JavaScript / HTML 5) - Other names: Benzenepropanoic acid; β-Phenylpropionic acid; Benzenepropionic acid; Benzylacetic acid; Dihydrocinnamic acid; Phenylpropanoic acid; 3-Phenylpropanoic acid; 3-Phenylpropionic acid; Phenylpropionic acid; β-Phenylpropanoic acid; NSC 9272

Gas phase ion energetics data

Data compiled by: Henry M. Rosenstock, Keith Draxl, Bruce W. Steiner, and John T. Herron
Ionization energy determinations
IE (eV) | Method | Reference |
---|---|---|
9.0 ± 0.1 | EI | Occolowitz, 1967 |
Appearance energy determinations
Ion | AE (eV) | Other Products | Method | Reference | Comment |
---|---|---|---|---|---|
C8H8+ | 9.8 ± 0.2 | HCOOH | EI | Occolowitz, 1967 |

Phase change data

Data compiled as indicated in comments:
BS - Robert L. Brown and Stephen E. Stein
TRC - Thermodynamics Research Center, NIST Boulder Laboratories, Chris Muzny director
AC - William E. Acree, Jr., James S. Chickos
DH - Eugene S. Domalski and Elizabeth D. Hearing
Quantity | Value | Units | Method | Reference | Comment |
---|---|---|---|---|---|
Tboil | 553.0 | K | N/A | Weast and Grasselli, 1989 | BS |
Quantity | Value | Units | Method | Reference | Comment |
Tfus | 321. | K | N/A | Timmermans, 1935 | Uncertainty assigned by TRC = 1.5 K; TRC |
Tfus | 321.15 | K | N/A | Adams and Marshall, 1928 | Uncertainty assigned by TRC = 1.5 K; TRC |
Tfus | 320. | K | N/A | Padoa, 1919 | Uncertainty assigned by TRC = 1. K; TRC |
Tfus | 321.6 | K | N/A | Eykman, 1889 | Uncertainty assigned by TRC = 0.1 K; TRC |
Quantity | Value | Units | Method | Reference | Comment |
ΔsubH° | 24.5 ± 0.2 | kcal/mol | ME | Monte and Hillesheim, 2001 | Based on data from 305. to 315. K.; AC |
Enthalpy of vaporization
ΔvapH (kcal/mol) | Temperature (K) | Method | Reference | Comment |
---|---|---|---|---|
16.0 | 390. | A | Stephenson and Malanowski, 1987 | Based on data from 375. to 553. K. See also Stull, 1947.; AC |
Antoine Equation Parameters
log10(P) = A − (B / (T + C))
P = vapor pressure (atm)
T = temperature (K)
View plot Requires a JavaScript / HTML 5 canvas capable browser.
Temperature (K) | A | B | C | Reference | Comment |
---|---|---|---|---|---|
375.3 to 552.9 | 5.74938 | 3055.464 | -21.359 | Stull, 1947 | Coefficents calculated by NIST from author's data. |
Enthalpy of sublimation
ΔsubH (kcal/mol) | Temperature (K) | Method | Reference | Comment |
---|---|---|---|---|
24.4 ± 0.2 | 310. | ME | Monte and Hillesheim, 2001 | Based on data from 305. to 315. K.; AC |
Enthalpy of fusion
ΔfusH (kcal/mol) | Temperature (K) | Method | Reference | Comment |
---|---|---|---|---|
3.731 | 321.2 | DSC | Monte and Hillesheim, 2001 | AC |
4.226 | 321.2 | N/A | Acree, 1991 | AC |
3.7199 | 321.6 | N/A | Eykman, 1889, 2 | DH |
Entropy of fusion
ΔfusS (cal/mol*K) | Temperature (K) | Reference | Comment |
---|---|---|---|
11.6 | 321.6 | Eykman, 1889, 2 | DH |

Reaction thermochemistry data

Data compiled by: Hussein Y. Afeefy, Joel F. Liebman, and Stephen E. Stein
Individual Reactions
By formula: 2H2 + C9H6O2 = C9H10O2
Quantity | Value | Units | Method | Reference | Comment |
---|---|---|---|---|---|
ΔrH° | -72.6 ± 1.1 | kcal/mol | Chyd | Flitcroft and Skinner, 1958 | liquid phase |

Van Den Dool and Kratz RI, non-polar column, temperature ramp

Column type | Active phase | I | Reference | Comment |
---|---|---|---|---|
Capillary | DB-5MS | 1347. | Schwambach and Peterson, 2006 | 30. m/0.25 mm/0.25 μm, H2, 30. C @ 2. min, 2. K/min, 250. C @ 2. min |
Capillary | DB-5 | 1344. | Colahan-Sederstrom and Peterson, 2005 | 30. m/0.25 mm/0.25 μm, N2, 40. C @ 2. min, 5. K/min, 230. C @ 6. min |
Capillary | DB-5 | 1363. | Karagül-Yüceer, Cadwallader, et al., 2002 | 30. m/0.32 mm/0.25 μm, 35. C @ 5. min, 10. K/min, 200. C @ 30. min |
Capillary | DB-5 | 1356. | Karagül-Yüceer, Drake, et al., 2001 | 30. m/0.32 mm/0.25 μm, 35. C @ 5. min, 10. K/min, 200. C @ 30. min |
Packed | SE-30 | 1329. | Peng, Ding, et al., 1988 | He, Supelcoport and Chromosorb, 40. C @ 4. min, 10. K/min, 250. C @ 60. min; Column length: 3.05 m |

Van Den Dool and Kratz RI, non-polar column, custom temperature program

Column type | Active phase | I | Reference | Comment |
---|---|---|---|---|
Capillary | VF-5MS | 1366.5 | Tret'yakov, 2007 | 30. m/0.25 mm/0.25 μm, He; Program: Multi-step temperature program; T(initial)=60C; T(final)=270C |

Van Den Dool and Kratz RI, polar column, temperature ramp

Column type | Active phase | I | Reference | Comment |
---|---|---|---|---|
Capillary | FFAP | 2635. | Schlutt B., Moran N., et al., 2007 | He, 40. C @ 2. min, 8. K/min, 240. C @ 5. min; Column length: 30. m; Column diameter: 0.32 mm |
Capillary | DB-FFAP | 2633. | Schwambach and Peterson, 2006 | 30. m/0.25 mm/0.25 μm, H2, 30. C @ 2. min, 3. K/min, 230. C @ 4. min |
Capillary | DB-FFAP | 2608. | Colahan-Sederstrom and Peterson, 2005 | 30. m/0.25 mm/0.25 μm, N2, 40. C @ 2. min, 5. K/min, 230. C @ 6. min |

Van Den Dool and Kratz RI, polar column, custom temperature program

Column type | Active phase | I | Reference | Comment |
---|---|---|---|---|
Capillary | DB-FFAP | 2638. | Rychlik and Bosset, 2001 | 30. m/0.32 mm/0.25 μm, He; Program: 35C(2min) => 40C/min => 60C (2min) => 5C/min => 240C |

Normal alkane RI, non-polar column, temperature ramp

Column type | Active phase | I | Reference | Comment |
---|---|---|---|---|
Capillary | HP-5 MS | 1361. | Jerkovic, Hegic, et al., 2010 | 30. m/0.25 mm/0.25 μm, Helium, 70. C @ 2. min, 3. K/min, 200. C @ 18. min |
Capillary | OV-101 | 1304. | Friedrich, Acree, et al., 2001 | 6. K/min; Column length: 15. m; Column diameter: 0.32 mm; Tstart: 35. C; Tend: 250. C |
Capillary | AT-1 | 1350. | Kelling, 2001 | He, 50. C @ 2. min, 10. K/min; Tend: 300. C |
Capillary | HP-1 | 1304. | Ong and Acree, 1999 | 4. K/min; Column length: 25. m; Column diameter: 0.20 mm; Tstart: 35. C; Tend: 250. C |
Capillary | HP-1 | 1304. | Ong and Acree, 1998 | 4. K/min; Column length: 25. m; Column diameter: 0.32 mm; Tstart: 35. C; Tend: 250. C |
Capillary | HP-1 | 1308. | Ong, Acree, et al., 1998 | 4. K/min; Column length: 25. m; Column diameter: 0.32 mm; Tstart: 35. C; Tend: 250. C |

Normal alkane RI, non-polar column, custom temperature program

Column type | Active phase | I | Reference | Comment |
---|---|---|---|---|
Capillary | HP-5MS | 1369. | Alissandrakis, Kibaris, et al., 2005 | 30. m/0.25 mm/0.25 μm, He; Program: 40C(3min) => 2C/min => 180C => 10C/min => 250C(5min) |
Capillary | DB-5 | 1343. | Hamm, Bleton, et al., 2004 | 30. m/0.25 mm/0.25 μm, He; Program: 40C(1min) => 9C/min => 130C => 2C/min => 230C |

Normal alkane RI, polar column, temperature ramp

Column type | Active phase | I | Reference | Comment |
---|---|---|---|---|
Capillary | DB-Wax | 2603. | Fan and Qian, 2006 | 30. m/0.32 mm/0.25 μm, He, 40. C @ 2. min, 4. K/min, 230. C @ 15. min |
Capillary | HP-Innowax | 2650. | Ong and Acree, 1999 | 4. K/min; Column length: 25. m; Column diameter: 0.25 mm; Tstart: 35. C; Tend: 250. C |
Capillary | HP-Innowax | 2650. | Ong and Acree, 1998 | 4. K/min; Column length: 25. m; Column diameter: 0.32 mm; Tstart: 35. C; Tend: 250. C |
Capillary | HP-Innowax | 2650. | Ong, Acree, et al., 1998 | 4. K/min; Column length: 25. m; Column diameter: 0.32 mm; Tstart: 35. C; Tend: 250. C |

Lee's RI, non-polar column, custom temperature program

Column type | Active phase | I | Reference | Comment |
---|---|---|---|---|
Capillary | Methyl Silicone | 230.64 | Eckel, Ross, et al., 1993 | Program: not specified |

References

Occolowitz, 1967
Occolowitz, J.L.,
Charge localization and the electronimpact fragmentation of carbonyl compounds,
Australian J. Chem., 1967, 20, 2387. [all data]