Dispiro[4.1.4.1]dodecane-6,12-dione
- Formula: C12H16O2
- Molecular weight: 192.2542
- IUPAC Standard InChIKey: TUECSRVQKHJHMP-UHFFFAOYSA-N
- CAS Registry Number: 5011-61-0
- Chemical structure:
View 3d structure (requires JavaScript / HTML 5) - Permanent link for this species. Use this link for bookmarking this species for future reference.

Gas phase ion energetics data

Data compiled as indicated in comments:
LBLHLM - Sharon G. Lias, John E. Bartmess, Joel F. Liebman, John L. Holmes, Rhoda D. Levin, and W. Gary Mallard
Ionization energy determinations
IE (eV) | Method | Reference | Comment |
---|---|---|---|
8.9 ± 0.01 | EI | Olivares, Flesch, et al., 1984 | LBLHLM |
Appearance energy determinations
Ion | AE (eV) | Other Products | Method | Reference | Comment |
---|---|---|---|---|---|
C11H16O+ | 9.5 ± 0.06 | CO | EI | Olivares, Flesch, et al., 1984 | LBLHLM |

References

Olivares, Flesch, et al., 1984
Olivares, J.A.; Flesch, G.D.; Svec, H.J.,
Mass spectrometry of five ketene dimers,
Int. J. Mass Spectrom. Ion Processes, 1984, 56, 293. [all data]