3,3'-Bicyclopentenyl
- Formula: C10H14
- Molecular weight: 134.2182
- IUPAC Standard InChIKey: VJEREEILRKZBKE-UHFFFAOYSA-N
- CAS Registry Number: 5009-17-6
- Chemical structure:
View 3d structure (requires JavaScript / HTML 5) - Species with the same structure:

Reaction thermochemistry data

Data compiled by: Hussein Y. Afeefy, Joel F. Liebman, and Stephen E. Stein
Individual Reactions
By formula: 2H2 + C10H14 = C10H18
Quantity | Value | Units | Method | Reference | Comment |
---|---|---|---|---|---|
ΔrH° | -228. ± 0.4 | kJ/mol | Chyd | Roth, Adamczak, et al., 1991 | liquid phase |

Gas phase ion energetics data

Data compiled by: Henry M. Rosenstock, Keith Draxl, Bruce W. Steiner, and John T. Herron
Appearance energy determinations
Ion | AE (eV) | Other Products | Method | Reference | Comment |
---|---|---|---|---|---|
C5H7+ | 9.75 | cyclo-C5H7 | EI | Pignataro, Cassuto, et al., 1967 |

References

Roth, Adamczak, et al., 1991
Roth, W.R.; Adamczak, O.; Breuckmann, R.; Lennartz, H.-W.; Boese, R.,
Die Berechnung von Resonanzenergien; das MM2ERW-Kraftfeld,
Chem. Ber., 1991, 124, 2499-2521. [all data]
Pignataro, Cassuto, et al., 1967
Pignataro, S.; Cassuto, A.; Lossing, F.P.,
Free radicals by mass spectrometry. XXXVI. Ionization potentials of conjugated and nonconjugated radicals,
J. Am. Chem. Soc., 1967, 89, 3693. [all data]