Bicyclo[2.2.2]octa-2,5-diene
- Formula: C8H10
- Molecular weight: 106.1650
- IUPAC Standard InChIKey: PPABCIZFQNHUIH-UHFFFAOYSA-N
- CAS Registry Number: 500-23-2
- Chemical structure:
View 3d structure (requires JavaScript / HTML 5) - Permanent link for this species. Use this link for bookmarking this species for future reference.

Reaction thermochemistry data

Data compiled by: Hussein Y. Afeefy, Joel F. Liebman, and Stephen E. Stein
Individual Reactions
By formula: 2H2 + C8H10 = C8H14
Quantity | Value | Units | Method | Reference | Comment |
---|---|---|---|---|---|
ΔrH° | -235.2 ± 0.42 | kJ/mol | Chyd | Turner, Meador, et al., 1957 | liquid phase; solvent: Acetic acid |

Gas phase ion energetics data

Data compiled as indicated in comments:
RDSH - Henry M. Rosenstock, Keith Draxl, Bruce W. Steiner, and John T. Herron
Ionization energy determinations
IE (eV) | Method | Reference | Comment |
---|---|---|---|
8.87 | PE | Bischof, Hashmall, et al., 1969 | Vertical value; RDSH |

Normal alkane RI, non-polar column, custom temperature program

Column type | Active phase | I | Reference | Comment |
---|---|---|---|---|
Capillary | Methyl Silicone | 817. | Zenkevich, 1998 | Program: not specified |

References

Turner, Meador, et al., 1957
Turner, R.B.; Meador, W.R.; Winkler, R.E.,
Heats of hydrogenation. I. Apparatus and the heats of hydrogenation of bicyclo[2,2,1]heptene, bicyclo[2,2,1]heptadiene, bicyclo[2,2,2]octene and bicyclo[2,2,2]octadiene,
J. Am. Chem. Soc., 1957, 79, 4116-4121. [all data]
Bischof, Hashmall, et al., 1969
Bischof, P.; Hashmall, J.A.; Heilbronner, E.; Hornung, V.,
Photoelektronspektroskopische Bestimmung der Wechselwirkung zwischen nichtkonjugierten Doppelbindungen,
Helv. Chim. Acta, 1969, 52, 1745. [all data]
Zenkevich, 1998
Zenkevich, I.G.,
Non-Traditional Criteria for Gas-Chromatographic and Chromato-Mass-Spectrometric Identification of Organic Compounds,
Zh. Anal. Khim., 1998, 53, 8, 828-835. [all data]