Hydrazine, 1,1-dipropyl-
- Formula: C6H16N2
- Molecular weight: 116.2046
- IUPAC Standard InChIKey: ZHHHDUSWMATTFE-UHFFFAOYSA-N
- CAS Registry Number: 4986-50-9
- Chemical structure:
View 3d structure (requires JavaScript / HTML 5) - Other names: 1,1-Dipropylhydrazine; 1,1-di-n-Propylhydrazine

Gas phase ion energetics data

Data compiled by: Sharon G. Lias, Rhoda D. Levin, and Sherif A. Kafafi
Ionization energy determinations
IE (eV) | Method | Reference | Comment |
---|---|---|---|
8.51 | PE | Nelsen and Buschek, 1974 | Vertical value |

Normal alkane RI, non-polar column, temperature ramp

Column type | Active phase | I | Reference | Comment |
---|---|---|---|---|
Capillary | OV-101 | 859. | Zenkevich, 2005 | 25. m/0.20 mm/0.10 μm, N2/He, 6. K/min; Tstart: 50. C; Tend: 250. C |

References

Nelsen and Buschek, 1974
Nelsen, S.F.; Buschek, J.M.,
Photoelectron spectra of hydrazines. III. Evidence for similar lone pair-lone pair dihedral angles for acyclic hydrazines,
J. Am. Chem. Soc., 1974, 96, 2392. [all data]
Zenkevich, 2005
Zenkevich, I.G.,
Experimentally measured retention indices., 2005. [all data]