1,5-Cyclooctadiyne
- Formula: C8H8
- Molecular weight: 104.1491
- IUPAC Standard InChIKey: URBAEOVIKFSRNB-UHFFFAOYSA-N
- CAS Registry Number: 49852-40-6
- Chemical structure:
View 3d structure (requires JavaScript / HTML 5) - Permanent link for this species. Use this link for bookmarking this species for future reference.

Reaction thermochemistry data

Data compiled by: Hussein Y. Afeefy, Joel F. Liebman, and Stephen E. Stein
Individual Reactions
By formula: 4H2 + C8H8 = C8H16
Quantity | Value | Units | Method | Reference | Comment |
---|---|---|---|---|---|
ΔrH° | 640. ± 1. | kJ/mol | Chyd | Roth, Hopf, et al., 1994 | liquid phase; solvent: Isooctane |

Gas phase ion energetics data

Data compiled as indicated in comments:
LLK - Sharon G. Lias, Rhoda D. Levin, and Sherif A. Kafafi
Ionization energy determinations
IE (eV) | Method | Reference | Comment |
---|---|---|---|
8.9 | PE | Bieri, Heilbronner, et al., 1974 | LLK |

References

Roth, Hopf, et al., 1994
Roth, W.R.; Hopf, H.; Horn, C.,
Propargyl-Stabilisierungsenergie,
Chem. Ber., 1994, 127, 1781-1795. [all data]
Bieri, Heilbronner, et al., 1974
Bieri, G.; Heilbronner, E.; Kloster-Jensen, E.; Schmelzer, A.; Wirz, J.,
Electronic states of 1,5-cyclooctadiyne radical cation and of related systems: the electronic structure of cis-bent carbon-carbon triple bonds,
Helv. Chim. Acta, 1974, 57, 1265. [all data]