1H-1,2-Diazepine, hexahydro-1,2-dimethyl
- Formula: C7H16N2
- Molecular weight: 128.2153
- IUPAC Standard InChIKey: HETZZQBBTGYZHG-UHFFFAOYSA-N
- CAS Registry Number: 49840-68-8
- Chemical structure:
View 3d structure (requires JavaScript / HTML 5) - Permanent link for this species. Use this link for bookmarking this species for future reference.

Gas phase ion energetics data

Data evaluated as indicated in comments:
HL - Edward P. Hunter and Sharon G. Lias
Data compiled as indicated in comments:
LBLHLM - Sharon G. Lias, John E. Bartmess, Joel F. Liebman, John L. Holmes, Rhoda D. Levin, and W. Gary Mallard
LLK - Sharon G. Lias, Rhoda D. Levin, and Sherif A. Kafafi
Quantity | Value | Units | Method | Reference | Comment |
---|---|---|---|---|---|
Proton affinity (review) | 966.8 | kJ/mol | N/A | Hunter and Lias, 1998 | HL |
Quantity | Value | Units | Method | Reference | Comment |
Gas basicity | 936.1 | kJ/mol | N/A | Hunter and Lias, 1998 | HL |
Ionization energy determinations
IE (eV) | Method | Reference | Comment |
---|---|---|---|
6.62 ± 0.05 | EQ | Rumack, 1986 | LBLHLM |
8.15 | PE | Nelsen, 1984 | Vertical value; LBLHLM |
7.88 | PE | Nelsen, Peacock, et al., 1976 | Vertical value; LLK |

References

Hunter and Lias, 1998
Hunter, E.P.; Lias, S.G.,
Evaluated Gas Phase Basicities and Proton Affinities of Molecules: An Update,
J. Phys. Chem. Ref. Data, 1998, 27, 3, 413-656, https://doi.org/10.1063/1.556018
. [all data]
Rumack, 1986
Rumack, D.,
Title unavailable,
Personal communication to S.G. Lias, 1986. [all data]
Nelsen, 1984
Nelsen, S.F.,
Ionization from nitrogen and oxygen lone pairs: A comparison of trialkylamine, dialkyl ether, tetraalkylhydrazine, and dialkyl peroxide photoelectron spectroscopic ionization potentials,
J. Org. Chem., 1984, 49, 1891. [all data]
Nelsen, Peacock, et al., 1976
Nelsen, S.F.; Peacock, V.; Weisman, G.R.,
Single-electron oxidation equilibria of tetraalkylhydrazines. Comparison of solution E° values and vapor-phase ionization potentials,
J. Am. Chem. Soc., 1976, 98, 5269. [all data]