t-Butyl p-methylphenyl sulfoxide
- Formula: C11H16OS
- Molecular weight: 196.309
- IUPAC Standard InChIKey: CUHLCVDOSQPTSU-UHFFFAOYSA-N
- CAS Registry Number: 49833-45-6
- Chemical structure:
View 3d structure (requires JavaScript / HTML 5) - Permanent link for this species. Use this link for bookmarking this species for future reference.

Gas phase ion energetics data

Data compiled as indicated in comments:
LLK - Sharon G. Lias, Rhoda D. Levin, and Sherif A. Kafafi
Ionization energy determinations
IE (eV) | Method | Reference | Comment |
---|---|---|---|
8.33 | PE | Mohraz, Jian-qi, et al., 1981 | Vertical value; LLK |

References

Mohraz, Jian-qi, et al., 1981
Mohraz, M.; Jian-qi, W.; Heilbronner, E.; Solladie-Cavallo, A.; Matloubi-Moghadam, F.,
11. Some comments on the conformations of methyl phenyl sulfides, sulfoxides and sulfones,
Helv. Chim. Acta, 1981, 64, 97. [all data]