2-Norbornanone
- Formula: C7H10O
- Molecular weight: 110.1537
- IUPAC Standard InChIKey: KPMKEVXVVHNIEY-UHFFFAOYSA-N
- CAS Registry Number: 497-38-1
- Chemical structure:
View 3d structure (requires JavaScript / HTML 5) - Other names: Bicyclo[2.2.1]heptan-2-one; Norbornan-2-one; Norcampher; Norcamphor; Bicyclo(2.2.1)-2-heptanone; Bicyclo[2.2.1]heptane-2-one; (±)-Bicyclo[2.2.1]heptan-2-one; 8,9,10-trinorbornan-2-one

Gas phase thermochemistry data

Data compiled by: Hussein Y. Afeefy, Joel F. Liebman, and Stephen E. Stein
Quantity | Value | Units | Method | Reference | Comment |
---|---|---|---|---|---|
ΔfH°gas | -170.6 ± 4.9 | kJ/mol | Ccb | Steele, 1978 | Reanalyzed by Cox and Pilcher, 1970, Original value = -168. ± 3. kJ/mol |

Condensed phase thermochemistry data

Data compiled by: Hussein Y. Afeefy, Joel F. Liebman, and Stephen E. Stein
Quantity | Value | Units | Method | Reference | Comment |
---|---|---|---|---|---|
ΔfH°solid | -216.6 ± 2.7 | kJ/mol | Ccb | Steele, 1978 | |
Quantity | Value | Units | Method | Reference | Comment |
ΔcH°solid | -3967.1 ± 2.7 | kJ/mol | Ccb | Steele, 1978 | Corresponding ΔfHºsolid = -216.6 kJ/mol (simple calculation by NIST; no Washburn corrections) |
ΔcH°solid | -3957.2 ± 4.2 | kJ/mol | Ccb | Becker and Roth, 1934 | Reanalyzed by Cox and Pilcher, 1970, Original value = -3958. kJ/mol; Corresponding ΔfHºsolid = -226.5 kJ/mol (simple calculation by NIST; no Washburn corrections) |

Phase change data

Data compiled as indicated in comments:
BS - Robert L. Brown and Stephen E. Stein
AC - William E. Acree, Jr., James S. Chickos
ALS - Hussein Y. Afeefy, Joel F. Liebman, and Stephen E. Stein
Quantity | Value | Units | Method | Reference | Comment |
---|---|---|---|---|---|
Tboil | 443.2 | K | N/A | Weast and Grasselli, 1989 | BS |
Quantity | Value | Units | Method | Reference | Comment |
ΔvapH° | 50.0 | kJ/mol | GC | van Roon, Parsons, et al., 2002 | AC |
ΔvapH° | 51.5 | kJ/mol | CGC | Chickos, Hosseini, et al., 1995 | Based on data from 343. to 383. K.; AC |
ΔvapH° | 49.6 | kJ/mol | CGC | Chickos, Hosseini, et al., 1995 | Based on data from 343. to 383. K.; AC |
Quantity | Value | Units | Method | Reference | Comment |
ΔsubH° | 49. ± 2. | kJ/mol | V | Steele, 1978 | ALS |
ΔsubH° | 49.0 ± 1.7 | kJ/mol | BG | Steele, 1978 | Based on data from 300. to 340. K.; AC |
Enthalpy of fusion
ΔfusH (kJ/mol) | Temperature (K) | Reference | Comment |
---|---|---|---|
3.39 | 368.7 | Acree, 1993 | AC |

Reaction thermochemistry data

Data compiled by: Hussein Y. Afeefy, Joel F. Liebman, and Stephen E. Stein
Individual Reactions
By formula: C9H14O2 + 2H2O = C7H10O + 2CH4O
Quantity | Value | Units | Method | Reference | Comment |
---|---|---|---|---|---|
ΔrH° | 22.97 ± 0.11 | kJ/mol | Cm | Wiberg and Cunningham, 1990 | liquid phase; Heat of hydrolysis |

Gas phase ion energetics data

Data evaluated as indicated in comments:
HL - Edward P. Hunter and Sharon G. Lias
Data compiled as indicated in comments:
LLK - Sharon G. Lias, Rhoda D. Levin, and Sherif A. Kafafi
Quantity | Value | Units | Method | Reference | Comment |
---|---|---|---|---|---|
Proton affinity (review) | 847.4 | kJ/mol | N/A | Hunter and Lias, 1998 | HL |
Quantity | Value | Units | Method | Reference | Comment |
Gas basicity | 815.5 | kJ/mol | N/A | Hunter and Lias, 1998 | HL |
Ionization energy determinations
IE (eV) | Method | Reference | Comment |
---|---|---|---|
8.9 | PE | Frost, Westwood, et al., 1980 | LLK |
9.17 ± 0.02 | PE | Frost, Westwood, et al., 1980 | Vertical value; LLK |
9.14 | PE | Hentrich, Gunkel, et al., 1974 | Vertical value; LLK |
8.94 ± 0.02 | PE | Chadwick, Frost, et al., 1971 | Vertical value; LLK |

Normal alkane RI, non-polar column, custom temperature program

Column type | Active phase | I | Reference | Comment |
---|---|---|---|---|
Capillary | SPB-5 | 983. | Plettner, Mohle, et al., 2005 | 30. m/0.25 mm/0.25 μm; Program: 50C(5min) => 5C/min => 100C(4min) => 50C/min => 250C(20min) |

References

Steele, 1978
Steele, W.V.,
The standard enthalpies of formation of bicyclic compounds. IV. Bicyclo[2.2.1]heptan-2-one and bicyclo[2.2.1]heptan-7-one,
J. Chem. Thermodyn., 1978, 10, 585-590. [all data]
Cox and Pilcher, 1970
Cox, J.D.; Pilcher, G.,
Thermochemistry of Organic and Organometallic Compounds, Academic Press, New York, 1970, 1-636. [all data]
Becker and Roth, 1934
Becker, G.; Roth, W.A.,
Verbrennungswarmen einiger cyclischer kohlenwasserstoffe,
Ber., 1934, 67, 627-632. [all data]
Weast and Grasselli, 1989
CRC Handbook of Data on Organic Compounds, 2nd Editon, Weast,R.C and Grasselli, J.G., ed(s)., CRC Press, Inc., Boca Raton, FL, 1989, 1. [all data]
van Roon, Parsons, et al., 2002
van Roon, André; Parsons, John R.; Govers, Harrie A.J.,
Gas chromatographic determination of vapour pressure and related thermodynamic properties of monoterpenes and biogenically related compounds,
Journal of Chromatography A, 2002, 955, 1, 105-115, https://doi.org/10.1016/S0021-9673(02)00200-5
. [all data]
Chickos, Hosseini, et al., 1995
Chickos, James S.; Hosseini, Sarah; Hesse, Donald G.,
Determination of vaporization enthalpies of simple organic molecules by correlations of changes in gas chromatographic net retention times,
Thermochimica Acta, 1995, 249, 41-62, https://doi.org/10.1016/0040-6031(95)90670-3
. [all data]
Acree, 1993
Acree, William E.,
Thermodynamic properties of organic compounds,
Thermochimica Acta, 1993, 219, 97-104, https://doi.org/10.1016/0040-6031(93)80486-T
. [all data]
Wiberg and Cunningham, 1990
Wiberg, K.B.; Cunningham, W.C., Jr.,
Thermochemical studies of carbonyl reactions. 4. Enthalpies of hydrolysis of norbornyl ketals,
J. Org. Chem., 1990, 55, 679-684. [all data]
Hunter and Lias, 1998
Hunter, E.P.; Lias, S.G.,
Evaluated Gas Phase Basicities and Proton Affinities of Molecules: An Update,
J. Phys. Chem. Ref. Data, 1998, 27, 3, 413-656, https://doi.org/10.1063/1.556018
. [all data]
Frost, Westwood, et al., 1980
Frost, D.C.; Westwood, N.P.C.; Werstiuk, N.H.,
Ultraviolet photoelectron spectra of 2-norbornanone, 2,5-norbornanedione. Their akyl derivatives and thio-analogues. An investigation of transannular interactions by photoelectron spectroscopy,
Can. J. Chem., 1980, 58, 1659. [all data]
Hentrich, Gunkel, et al., 1974
Hentrich, G.; Gunkel, E.; Klessinger, M.,
Photoelektronenspektren organischer verbindungen. 4. Photoelektronenspektren ungesattigter carbonylverbindungen,
J. Mol. Struct., 1974, 21, 231. [all data]
Chadwick, Frost, et al., 1971
Chadwick, D.; Frost, D.C.; Weiler, L.,
Photoelectron spectra of norbornanones and norbornenones,
J. Am. Chem. Soc., 1971, 93, 4962. [all data]
Plettner, Mohle, et al., 2005
Plettner, E.; Mohle, A.; Mwangi, M.T.; Griscti, J.; Patrick, B.O.; Nair, R.; Batchelor, R.J.; Einstein, F.,
2-Chlorobicyclo[2.2.1]hept-5-ene-2-carboxamide and 2-chlorobicyclo[2.2.1]heptane-2-carboxamide as precursors of bicyclo[2.2.1]hept-5-en-2-one and bicyclo[2.2.1]heptan-2-one: resolution, absolute configuration and hydrogen-bonding properties,
Tetrahedron: Asymmetry, 2005, 16, 16, 2754-2763, https://doi.org/10.1016/j.tetasy.2005.07.016
. [all data]