2-Methylenebicyclo[2.2.1]-heptane
- Formula: C8H12
- Molecular weight: 108.1809
- IUPAC Standard InChIKey: AJQVASAUQUTVJK-UHFFFAOYSA-N
- CAS Registry Number: 497-35-8
- Chemical structure:
View 3d structure (requires JavaScript / HTML 5) - Other names: Bicyclo[2.2.1]heptane,2-methylene-; Norbornane, 2-methylene-; 2-Methylenenorbornane

Condensed phase thermochemistry data

Data compiled by: Hussein Y. Afeefy, Joel F. Liebman, and Stephen E. Stein
Quantity | Value | Units | Method | Reference | Comment |
---|---|---|---|---|---|
ΔfH°liquid | -4.1 ± 1.7 | kJ/mol | Ccb | Skuratov, Kozina, et al., 1969 | |
Quantity | Value | Units | Method | Reference | Comment |
ΔcH°liquid | -4859.0 ± 1.6 | kJ/mol | Ccb | Skuratov, Kozina, et al., 1969 | Corresponding ΔfHºliquid = -4.1 kJ/mol (simple calculation by NIST; no Washburn corrections) |

Reaction thermochemistry data

Data compiled by: John E. Bartmess
Individual Reactions
By formula: C8H11- + H+ = C8H12
Quantity | Value | Units | Method | Reference | Comment |
---|---|---|---|---|---|
ΔrH° | 1628.5 ± 3.6 | kJ/mol | G+TS | Lee and Squires, 1986 | gas phase; 0.4 kcal < HOH |
Quantity | Value | Units | Method | Reference | Comment |
ΔrG° | 1599.5 ± 2.5 | kJ/mol | IMRE | Lee and Squires, 1986 | gas phase; 0.4 kcal < HOH |

Gas phase ion energetics data

Data evaluated as indicated in comments:
HL - Edward P. Hunter and Sharon G. Lias
Data compiled as indicated in comments:
B - John E. Bartmess
LLK - Sharon G. Lias, Rhoda D. Levin, and Sherif A. Kafafi
Quantity | Value | Units | Method | Reference | Comment |
---|---|---|---|---|---|
Proton affinity (review) | 860.7 | kJ/mol | N/A | Hunter and Lias, 1998 | HL |
Quantity | Value | Units | Method | Reference | Comment |
Gas basicity | 831.8 | kJ/mol | N/A | Hunter and Lias, 1998 | HL |
Ionization energy determinations
IE (eV) | Method | Reference | Comment |
---|---|---|---|
9.04 | PE | Asmus and Klessinger, 1974 | Vertical value; LLK |
9.02 | PE | Cowling, Johnstone, et al., 1973 | Vertical value; LLK |
De-protonation reactions
By formula: C8H11- + H+ = C8H12
Quantity | Value | Units | Method | Reference | Comment |
---|---|---|---|---|---|
ΔrH° | 1628.5 ± 3.6 | kJ/mol | G+TS | Lee and Squires, 1986 | gas phase; 0.4 kcal < HOH; B |
Quantity | Value | Units | Method | Reference | Comment |
ΔrG° | 1599.5 ± 2.5 | kJ/mol | IMRE | Lee and Squires, 1986 | gas phase; 0.4 kcal < HOH; B |

References

Skuratov, Kozina, et al., 1969
Skuratov, S.M.; Kozina, M.P.; Timofeeva, L.P.; Belikova, N.A.; Plate, A.F.,
Heats of combustion, formation, isomerization, and hydrogenation of 2-methylenebicyclo[2,2,1]heptane and a mixture of exo- and endo-5-methylbicyclo[2.2.1]hept-2-ene,
Dokl. Akad. Nauk SSSR, 1969, 187, 343-346. [all data]
Lee and Squires, 1986
Lee, R.E.; Squires, R.R.,
Anionic homoaromaticity: A gas phase experimental study,
J. Am. Chem. Soc., 1986, 105, 5078. [all data]
Hunter and Lias, 1998
Hunter, E.P.; Lias, S.G.,
Evaluated Gas Phase Basicities and Proton Affinities of Molecules: An Update,
J. Phys. Chem. Ref. Data, 1998, 27, 3, 413-656, https://doi.org/10.1063/1.556018
. [all data]
Asmus and Klessinger, 1974
Asmus, P.; Klessinger, M.,
Photoelectron spectra of organic compounds. VI. Exocyclic methylene compounds,
Tetrahedron, 1974, 30, 2477. [all data]
Cowling, Johnstone, et al., 1973
Cowling, S.A.; Johnstone, R.A.W.; Gorman, A.A.; Smith, P.G.,
Photoelectron spectrum of 5-methylenenorborn-2-ene and through-space interactions (homobutadiene conjugation),
J. Chem. Soc., Chem. Commun., 1973, 627. [all data]