Oxazolidin-2-one
- Formula: C3H5NO2
- Molecular weight: 87.0773
- IUPAC Standard InChIKey: IZXIZTKNFFYFOF-UHFFFAOYSA-N
- CAS Registry Number: 497-25-6
- Chemical structure:
View 3d structure (requires JavaScript / HTML 5) - Other names: 2-Oxazolidone; 2-Oxazolidinone; Carbamic acid, (2-hydroxyethyl)-, γ-lactone; Oxazolidone; 1,3-Oxazolidin-2-one; 2-Oxazolidine

Phase change data

Data compiled as indicated in comments:
BS - Robert L. Brown and Stephen E. Stein
AC - William E. Acree, Jr., James S. Chickos
Reduced pressure boiling point
Tboil (K) | Pressure (bar) | Reference | Comment |
---|---|---|---|
493.2 | 0.064 | Weast and Grasselli, 1989 | BS |
Enthalpy of fusion
ΔfusH (kJ/mol) | Temperature (K) | Reference | Comment |
---|---|---|---|
17.3 | 360. | Smirnova, Markin, et al., 2004 | AC |

Gas phase ion energetics data

Data compiled as indicated in comments:
LLK - Sharon G. Lias, Rhoda D. Levin, and Sherif A. Kafafi
Ionization energy determinations
IE (eV) | Method | Reference | Comment |
---|---|---|---|
9.6 | PE | Andreocci, Devillanova, et al., 1980 | LLK |
10.06 | PE | Andreocci, Devillanova, et al., 1980 | Vertical value; LLK |
10.21 | PE | Gerson, Worley, et al., 1978 | Vertical value; LLK |

References

Weast and Grasselli, 1989
CRC Handbook of Data on Organic Compounds, 2nd Editon, Weast,R.C and Grasselli, J.G., ed(s)., CRC Press, Inc., Boca Raton, FL, 1989, 1. [all data]
Smirnova, Markin, et al., 2004
Smirnova, N.N.; Markin, A.V.; Kandeev, K.V.; Hocker, H.; Keul, H.,
Thermodynamics of dimethylene urethane and poly(dimethylene urethane) in the range from T → 0 to 490 K at standard pressure,
Thermochimica Acta, 2004, 409, 1, 55-62, https://doi.org/10.1016/S0040-6031(03)00328-9
. [all data]
Andreocci, Devillanova, et al., 1980
Andreocci, M.V.; Devillanova, F.A.; Furlani, C.; Mattogno, G.; Verani, G.; Zanoni, R.,
Structural characterization of some substituted azolidine molecules: UPS photoelectron spectroscopic studies,
J. Mol. Struct., 1980, 69, 151. [all data]
Gerson, Worley, et al., 1978
Gerson, S.H.; Worley, S.D.; Bodor, N.; Kaminski, J.J.; Flechtner, T.W.,
The photoelectron spectra of some heterocyclic compounds which contain N, O, Cl, and Br,
J. Electron Spectrosc. Relat. Phenom., 1978, 13, 421. [all data]