Cyclooctenecyclopentadienylmanganese dicarbonyl

Gas phase ion energetics data

Data compiled by: Henry M. Rosenstock, Keith Draxl, Bruce W. Steiner, and John T. Herron

Ionization energy determinations

IE (eV) Method Reference
7.0 ± 0.1EIMuller and Herberhold, 1968

Appearance energy determinations

Ion AE (eV) Other Products MethodReferenceComment
C13H19Mn+7.9 ± 0.12COEIMuller and Herberhold, 1968

References

Muller and Herberhold, 1968
Muller, J.; Herberhold, M., Massenspektroskopische Untersuchungen an C5H5Mn(CO)3 und C5H5Mn(CO)2 L-Komplexen, J. Organometal. Chem., 1968, 13, 399. [all data]