2-Butenal, 2-methyl-, (E)-
- Formula: C5H8O
- Molecular weight: 84.1164
- IUPAC Standard InChIKey: ACWQBUSCFPJUPN-HYXAFXHYSA-N
- CAS Registry Number: 497-03-0
- Chemical structure:
View 3d structure (requires JavaScript / HTML 5) - Species with the same structure:
- Stereoisomers:
- Other names: Crotonaldehyde, 2-methyl-, (E)-; trans-Tiglaldehyde; trans-2-Methyl-2-butenal; E-2-Methyl-2-butenal; Tiglaldehyde; Tiglic acid aldehyde; Tiglic aldehyde; (2E)-2-Methyl-2-butenal; 2-Methyl-2-butenal, (E); 2-Methyl-2-butenal, trans; 2-Methyl-2(E)-butenal; 2-Methylbut-(E)-2-enal; 2-Methyl-(E)-2-butenal; (E)-2-Methylbut-2-enal; 2-Butenal, 2-methyl-, (2E)-; NSC 2179; Tiglaldehyde (2-Methyl-2-butenal)

Condensed phase thermochemistry data

Data compiled by: Hussein Y. Afeefy, Joel F. Liebman, and Stephen E. Stein
Quantity | Value | Units | Method | Reference | Comment |
---|---|---|---|---|---|
ΔcH°liquid | -688.1 | kcal/mol | Ccb | Clopatt, 1932 | Corresponding ΔfHºliquid = -55.4 kcal/mol (simple calculation by NIST; no Washburn corrections) |

Phase change data

Data compiled as indicated in comments:
BS - Robert L. Brown and Stephen E. Stein
AC - William E. Acree, Jr., James S. Chickos
Reduced pressure boiling point
Tboil (K) | Pressure (atm) | Reference | Comment |
---|---|---|---|
390.7 | 0.989 | Aldrich Chemical Company Inc., 1990 | BS |
337.2 | 0.157 | Weast and Grasselli, 1989 | BS |
Enthalpy of vaporization
ΔvapH (kcal/mol) | Temperature (K) | Method | Reference | Comment |
---|---|---|---|---|
9.37 | 263. | A | Stephenson and Malanowski, 1987 | Based on data from 248. to 390. K. See also Stull, 1947.; AC |
Antoine Equation Parameters
log10(P) = A − (B / (T + C))
P = vapor pressure (atm)
T = temperature (K)
View plot Requires a JavaScript / HTML 5 canvas capable browser.
Temperature (K) | A | B | C | Reference | Comment |
---|---|---|---|---|---|
248. to 389.6 | 4.75796 | 1782.649 | -14.768 | Stull, 1947 | Coefficents calculated by NIST from author's data. |

Gas phase ion energetics data

Data compiled as indicated in comments:
LLK - Sharon G. Lias, Rhoda D. Levin, and Sherif A. Kafafi
Ionization energy determinations
IE (eV) | Method | Reference | Comment |
---|---|---|---|
9.60 | PE | Masclet and Mouvier, 1978 | LLK |

Van Den Dool and Kratz RI, non-polar column, temperature ramp

View large format table.

Column type Active phase I Reference Comment
CapillaryDB-5745.Methven L., Tsoukka M., et al., 200760. m/0.32 mm/1. μm, 40. C @ 2. min, 4. K/min, 260. C @ 10. min
CapillaryCP-Sil 8CB-MS739.Bruna, Hierro, et al., 200160. m/0.25 mm/0.25 μm, 40. C @ 2. min, 4. K/min; Tend: 280. C
CapillaryBPX-5755.Aaslyng, Elmore, et al., 199850. m/0.32 mm/0.50 μm, He, 4. K/min; Tstart: 40. C; Tend: 280. C
CapillaryDB-1724.Bartelt, 199730. m/0.32 mm/5. μm, He, 35. C @ 1. min, 10. K/min; Tend: 270. C

Van Den Dool and Kratz RI, non-polar column, custom temperature program

View large format table.

Column type Active phase I Reference Comment
CapillaryCP-Sil 8CB-MS745.Elmore, Mottram, et al., 200060. m/0.25 mm/0.25 μm, He; Program: 0C(5min) => 40C/min => 40C (2min) => 4C/min => 280C
CapillaryBPX-5763.Elmore, Mottram, et al., 199950. m/0.32 mm/0.5 μm, He; Program: 0C(5min) => 40C/min => 40C(2min) => 4C/min => 280C

Van Den Dool and Kratz RI, polar column, temperature ramp

View large format table.

Column type Active phase I Reference Comment
CapillaryStabilwax1082.Cros, Lignot, et al., 200560. m/0.25 mm/0.25 μm, He, 40. C @ 5. min, 3. K/min, 240. C @ 10. min
CapillarySupelcowax-101107.Elmore, Nisyrios, et al., 200560. m/0.25 mm/0.25 μm, He, 40. C @ 2. min, 4. K/min; Tend: 280. C
CapillaryDB-Wax1113.Nielsen, Larsen, et al., 200430. m/0.25 mm/0.25 μm, He, 45. C @ 10. min, 6. K/min, 240. C @ 30. min
CapillaryDB-Wax1113.Nielsen, Larsen, et al., 2004, 230. m/0.25 mm/0.25 μm, He, 45. C @ 10. min, 6. K/min, 240. C @ 30. min
CapillaryDB-Wax1069.Varming, Andersen, et al., 200430. m/0.25 mm/0.25 μm, He, 40. C @ 10. min, 6. K/min, 240. C @ 25. min
CapillaryStabilwax1082.Cros, Vandanjon, et al., 200360. m/0.25 mm/0.25 μm, He, 40. C @ 5. min, 3. K/min, 240. C @ 10. min
CapillaryDB-Wax1113.Nielsen, Larsen, et al., 200330. m/0.25 mm/0.25 μm, He, 40. C @ 10. min, 6. K/min, 240. C @ 30. min
CapillarySupelcowax-101096.Chung, Yung, et al., 200260. m/0.25 mm/0.25 μm, He, 35. C @ 5. min, 2. K/min, 195. C @ 90. min
CapillarySupelcowax-101096.Chung, Yung, et al., 200160. m/0.25 mm/0.25 μm, He, 35. C @ 5. min, 2. K/min, 195. C @ 90. min
CapillaryDB-Wax1101.Le Guen, Prost, et al., 200060. m/0.32 mm/0.5 μm, He, 40. C @ 2. min, 4. K/min, 250. C @ 10. min
CapillarySupelcowax-101097.Chung, 199960. m/0.25 mm/0.25 μm, He, 35. C @ 5. min, 2. K/min, 195. C @ 90. min
CapillaryDB-Wax1088.Cha, Kim, et al., 199860. m/0.25 mm/0.25 μm, 40. C @ 5. min, 3. K/min, 200. C @ 60. min
CapillaryDB-Wax1074.Fröhlich, Duque, et al., 198930. m/0.25 mm/0.25 μm, He, 50. C @ 3. min, 4. K/min; Tend: 250. C
CapillaryDB-Wax1075.Fröhlich, Duque, et al., 198930. m/0.25 mm/0.25 μm, He, 50. C @ 3. min, 4. K/min; Tend: 250. C
CapillarySupelcowax-101098.Tanchotikul and Hsieh, 198960. m/0.25 mm/0.25 μm, 40. C @ 5. min, 2. K/min, 175. C @ 20. min
CapillarySupelcowax-101104.Tanchotikul and Hsieh, 198960. m/0.25 mm/0.25 μm, 40. C @ 5. min, 2. K/min, 175. C @ 20. min

Van Den Dool and Kratz RI, polar column, custom temperature program

View large format table.

Column type Active phase I Reference Comment
CapillaryCP-Wax 52CB1094.Alasalvar, Shahidi, et al., 200360. m/0.25 mm/0.25 μm, He; Program: 40C => 5C/min => 60C => 2.5C/min => 155C
CapillarySupelcowax-101091.Baek and Cadwallader, 199660. m/0.25 mm/0.25 μm; Program: 40C => (6C/min) => 80C(6min) => (15C/min) => 200C(10min)

Normal alkane RI, non-polar column, temperature ramp

View large format table.

Column type Active phase I Reference Comment
CapillaryDB-1715.Binder, Benson, et al., 19904. K/min, 230. C @ 10. min; Column length: 60. m; Column diameter: 0.32 mm; Tstart: 50. C

Normal alkane RI, non-polar column, custom temperature program

View large format table.

Column type Active phase I Reference Comment
CapillarySLB-5 MS738.Costa, De Fina, et al., 200830. m/0.25 mm/0.25 μm, Helium; Program: 50 0C 3 0C/min -> 250 0C (1 min) 10 0C/min -> 300 0C (5 min)
CapillarySLB-5 MS737.Costa, De Fina, et al., 200830. m/0.25 mm/0.25 μm, Helium; Program: not specified
CapillaryHP-5749.Splivallo, Bossi, et al., 2007He; Program: 50C => 3C/min => 200C(10min) => 10C/min => 290C(10min)
CapillaryDB-1715.Binder, Flath, et al., 1989Column length: 60. m; Column diameter: 0.32 mm; Program: not specified

Normal alkane RI, polar column, temperature ramp

View large format table.

Column type Active phase I Reference Comment
CapillaryAT-Wax1076.Kiss, Csoka, et al., 201160. m/0.25 mm/0.25 μm, Helium, 4. K/min; Tstart: 60. C; Tend: 280. C
CapillaryStabilwax1082.Cros, Vandanjon, et al., 200760. m/0.25 mm/0.25 μm, Helium, 40. C @ 5. min, 3. K/min, 240. C @ 10. min
CapillaryStabilwax1082.Cros, Vandanjon, et al., 2003, 260. m/0.25 mm/0.25 μm, Helium, 40. C @ 5. min, 3. K/min, 240. C @ 10. min
CapillaryDB-Wax1069.Umano, Nakahara, et al., 199960. m/0.25 mm/0.25 μm, He, 40. C @ 2. min, 2. K/min; Tend: 200. C
CapillarySupelcowax-101104.Campeanu, Burcea, et al., 199860. m/0.32 mm/0.5 μm, H2, 35. C @ 5. min, 5. K/min, 250. C @ 20. min
CapillaryDB-Wax1084.Horiuchi, Umano, et al., 199860. m/0.25 mm/1. μm, He, 3. K/min, 200. C @ 40. min; Tstart: 50. C
CapillaryDB-Wax1092.Binder, Benson, et al., 19904. K/min, 230. C @ 10. min; Column length: 60. m; Column diameter: 0.32 mm; Tstart: 50. C
CapillaryDB-Wax1090.Binder, Flath, et al., 198950. C @ 0.1 min, 4. K/min, 230. C @ 10. min; Column length: 60. m; Column diameter: 0.32 mm

Normal alkane RI, polar column, custom temperature program

View large format table.

Column type Active phase I Reference Comment
CapillarySOLGel-Wax1098.Johanningsmeier and McFeeters, 201130. m/0.25 mm/0.25 μm, Helium; Program: 40 0C (2 min) 5 0C/min -> 140 0C 10 0C/min -> 250 0C (3 min)
CapillarySOLGel-Wax1094.Johanningsmeier and McFeeters, 201130. m/0.25 mm/0.25 μm, Helium; Program: not specified
CapillaryDB-Wax1092.Binder, Flath, et al., 1989Column length: 60. m; Column diameter: 0.32 mm; Program: not specified

References

Clopatt, 1932
Clopatt, J.A.,
Eine neue Methode zur Bestimmung der Verbrennungswarme fluchtiger Stoffe,
Soc. Scient. Fenn. Commentat. Phys. Math., 1932, 6, 1-15. [all data]
Aldrich Chemical Company Inc., 1990
Aldrich Chemical Company Inc.,
Catalog Handbook of Fine Chemicals, Aldrich Chemical Company, Inc., Milwaukee WI, 1990, 1. [all data]
Weast and Grasselli, 1989
CRC Handbook of Data on Organic Compounds, 2nd Editon, Weast,R.C and Grasselli, J.G., ed(s)., CRC Press, Inc., Boca Raton, FL, 1989, 1. [all data]
Stephenson and Malanowski, 1987
Stephenson, Richard M.; Malanowski, Stanislaw,
Handbook of the Thermodynamics of Organic Compounds, 1987, https://doi.org/10.1007/978-94-009-3173-2
. [all data]
Stull, 1947
Stull, Daniel R.,
Vapor Pressure of Pure Substances. Organic and Inorganic Compounds,
Ind. Eng. Chem., 1947, 39, 4, 517-540, https://doi.org/10.1021/ie50448a022
. [all data]
Masclet and Mouvier, 1978
Masclet, P.; Mouvier, G.,
Etude par spectrometrie photoelectronique d'aldehydes et de cetones ethyleniques conjugues,
J. Electron Spectrosc. Relat. Phenom., 1978, 14, 77. [all data]