Arsine oxide, trimethyl-
- Formula: C3H9AsO
- Molecular weight: 136.0246
- IUPAC Standard InChIKey: JWOWJQPAYGEFFK-UHFFFAOYSA-N
- CAS Registry Number: 4964-14-1
- Chemical structure:
View 3d structure (requires JavaScript / HTML 5) - Permanent link for this species. Use this link for bookmarking this species for future reference.

Gas phase ion energetics data

Data compiled by: Sharon G. Lias, Rhoda D. Levin, and Sherif A. Kafafi
Ionization energy determinations
IE (eV) | Method | Reference | Comment |
---|---|---|---|
9.08 | PE | Starzewski, Richter, et al., 1976 | Vertical value |

References

Starzewski, Richter, et al., 1976
Starzewski, K.-H.A.O.; Richter, W.; Schmidbaur, H.,
Photoelektronenspektren und Struktur von Arsenyliden. P versus As: Ein Beitrag zur Problematik der ylidischen Bindung,
Chem. Ber., 1976, 109, 473. [all data]