Isophosphinoline, 3-methyl-
- Formula: C10H9P
- Molecular weight: 160.1522
- IUPAC Standard InChIKey: MLFHRAFKAKVRKS-UHFFFAOYSA-N
- CAS Registry Number: 49622-63-1
- Chemical structure:
View 3d structure (requires JavaScript / HTML 5) - Permanent link for this species. Use this link for bookmarking this species for future reference.

Gas phase ion energetics data

Data compiled by: Sharon G. Lias, Rhoda D. Levin, and Sherif A. Kafafi
Ionization energy determinations
IE (eV) | Method | Reference |
---|---|---|
7.96 | PE | Schafer, Schweig, et al., 1975 |

References

Schafer, Schweig, et al., 1975
Schafer, W.; Schweig, A.; Vermeer, H.; Bickel-haupt, F.; De Graaf, H.,
On the nature of the "free electron pair" on phosphorus in aromatic phosphorus compounds: the photoelectron spectrum of 2-phosphanaphthalene,
J. Electron Spectrosc. Relat. Phenom., 1975, 6, 91. [all data]