1H-Indole, 2,3-dihydro-
- Formula: C8H9N
- Molecular weight: 119.1638
- IUPAC Standard InChIKey: LPAGFVYQRIESJQ-UHFFFAOYSA-N
- CAS Registry Number: 496-15-1
- Chemical structure:
View 3d structure (requires JavaScript / HTML 5) - Other names: Indoline; 1-Azaindan; 2,3-Dihydroindole; 2,3-Dihydro-1H-Indole; Dihydroindole; Indolene; Indole, 2,3-dihydro-

Phase change data

Data compiled as indicated in comments:
BS - Robert L. Brown and Stephen E. Stein
TRC - Thermodynamics Research Center, NIST Boulder Laboratories, Chris Muzny director
AC - William E. Acree, Jr., James S. Chickos
Quantity | Value | Units | Method | Reference | Comment |
---|---|---|---|---|---|
Tboil | 493.7 | K | N/A | Aldrich Chemical Company Inc., 1990 | BS |
Tboil | 502.2 | K | N/A | Weast and Grasselli, 1989 | BS |
Tboil | 503. | K | N/A | Adkins and Coonradt, 1941 | Uncertainty assigned by TRC = 4. K; TRC |
Quantity | Value | Units | Method | Reference | Comment |
ΔvapH° | 61.9 ± 1.7 | kJ/mol | C | Ribeiro da Silva, Cabral, et al., 2008 | AC |
Reduced pressure boiling point
Tboil (K) | Pressure (bar) | Reference | Comment |
---|---|---|---|
345.7 | 0.003 | Weast and Grasselli, 1989 | BS |

Gas phase ion energetics data

Data evaluated as indicated in comments:
HL - Edward P. Hunter and Sharon G. Lias
Data compiled as indicated in comments:
LLK - Sharon G. Lias, Rhoda D. Levin, and Sherif A. Kafafi
Quantity | Value | Units | Method | Reference | Comment |
---|---|---|---|---|---|
Proton affinity (review) | 957.1 | kJ/mol | N/A | Hunter and Lias, 1998 | HL |
Quantity | Value | Units | Method | Reference | Comment |
Gas basicity | 926.3 | kJ/mol | N/A | Hunter and Lias, 1998 | HL |
Ionization energy determinations
IE (eV) | Method | Reference | Comment |
---|---|---|---|
7.15 ± 0.02 | PE | Maier and Turner, 1973 | LLK |

Van Den Dool and Kratz RI, non-polar column, temperature ramp

Column type | Active phase | I | Reference | Comment |
---|---|---|---|---|
Capillary | DB-5 | 1195.8 | Song, Lai, et al., 2003 | 30. m/0.25 mm/0.25 μm, He, 2. K/min; Tstart: 40. C; Tend: 310. C |
Capillary | DB-5 | 1195.8 | Lai and Song, 1995 | 30. m/0.25 mm/0.25 μm, He, 2. K/min; Tstart: 40. C; Tend: 310. C |

Normal alkane RI, non-polar column, temperature ramp

Column type | Active phase | I | Reference | Comment |
---|---|---|---|---|
Capillary | Ultra-1 | 1166. | Okumura, 1991 | 25. m/0.32 mm/0.25 μm, He, 3. K/min; Tstart: 80. C; Tend: 260. C |

Lee's RI, non-polar column, temperature ramp

Column type | Active phase | I | Reference | Comment |
---|---|---|---|---|
Capillary | SE-52 | 204.74 | Lee, Vassilaros, et al., 1979 | 12. m/0.3 mm/0.34 μm, He, 2. K/min; Tstart: 50. C; Tend: 250. C |

References

Aldrich Chemical Company Inc., 1990
Aldrich Chemical Company Inc.,
Catalog Handbook of Fine Chemicals, Aldrich Chemical Company, Inc., Milwaukee WI, 1990, 1. [all data]
Weast and Grasselli, 1989
CRC Handbook of Data on Organic Compounds, 2nd Editon, Weast,R.C and Grasselli, J.G., ed(s)., CRC Press, Inc., Boca Raton, FL, 1989, 1. [all data]
Adkins and Coonradt, 1941
Adkins, H.; Coonradt, H.L.,
The Selective Hydrogenation of Derivatives of Pyrrole, Indole, Carbazole and Acridine,
J. Am. Chem. Soc., 1941, 63, 1563-70. [all data]
Ribeiro da Silva, Cabral, et al., 2008
Ribeiro da Silva, Manuel A.V.; Cabral, Joana I.T.A.; Gomes, Jose R.B.,
Experimental and Computational Study on the Molecular Energetics of Indoline and Indole,
J. Phys. Chem. A, 2008, 112, 47, 12263-12269, https://doi.org/10.1021/jp8065212
. [all data]
Hunter and Lias, 1998
Hunter, E.P.; Lias, S.G.,
Evaluated Gas Phase Basicities and Proton Affinities of Molecules: An Update,
J. Phys. Chem. Ref. Data, 1998, 27, 3, 413-656, https://doi.org/10.1063/1.556018
. [all data]
Maier and Turner, 1973
Maier, J.P.; Turner, D.W.,
Steric inhibition of resonance studied by molecular photoelectron spectroscopy Part 3. Anilines, Phenols and Related Compounds,
J. Chem. Soc. Faraday Trans. 2, 1973, 69, 521. [all data]
Song, Lai, et al., 2003
Song, C.; Lai, W.-C.; Madhusudan Reddy, K.; Wei, B.,
Chapter 7. Temperature-programmed retention indices for GC and GC-MS of hydrocarbon fuels and simulated distillation GC of heavy oils
in Analytical advances for hydrocarbon research, Hsu,C.S., ed(s)., Kluwer Academic/Plenum Publishers, New York, 2003, 147-193. [all data]
Lai and Song, 1995
Lai, W.-C.; Song, C.,
Temperature-programmed retention indices for g.c. and g.c.-m.s. analysis of coal- and petroleum-derived liquid fuels,
Fuel, 1995, 74, 10, 1436-1451, https://doi.org/10.1016/0016-2361(95)00108-H
. [all data]
Okumura, 1991
Okumura, T.,
retention indices of environmental chemicals on methyl silicone capillary column,
Journal of Environmental Chemistry (Japan), 1991, 1, 2, 333-358, https://doi.org/10.5985/jec.1.333
. [all data]
Lee, Vassilaros, et al., 1979
Lee, M.L.; Vassilaros, D.L.; White, C.M.; Novotny, M.,
Retention Indices for Programmed-Temperature Capillary-Column Gas Chromatography of Polycyclic Aromatic Hydrocarbons,
Anal. Chem., 1979, 51, 6, 768-773, https://doi.org/10.1021/ac50042a043
. [all data]