Indane
- Formula: C9H10
- Molecular weight: 118.1757
- IUPAC Standard InChIKey: PQNFLJBBNBOBRQ-UHFFFAOYSA-N
- CAS Registry Number: 496-11-7
- Chemical structure:
View 3d structure (requires JavaScript / HTML 5) - Other names: 1H-Indene, 2,3-dihydro-; Indan; Benzocyclopentane; Hydrindene; Indene, 2,3-dihydro-; 1,2-Hydrindene; 2,3-Dihydroindene; 2,3-Dihydro-1H-indene; Hydrindonaphthene; NSC 5292

Gas phase thermochemistry data

Data compiled as indicated in comments:
DRB - Donald R. Burgess, Jr.
GT - Glushko Thermocenter, Russian Academy of Sciences, Moscow
Quantity | Value | Units | Method | Reference | Comment |
---|---|---|---|---|---|
ΔfH°gas | 60.9 ± 2.1 | kJ/mol | Review | Roux, Temprado, et al., 2008 | There are sufficient high-quality literature values to make a good evaluation with a high degree of confidence. In general, the evaluated uncertainty limits are on the order of (0.5 to 2.5) kJ/mol.; DRB |
ΔfH°gas | 60.7 ± 1.5 | kJ/mol | N/A | Good, 1971 | Value computed using ΔfHliquid° value of 11.7±1.5 kj/mol from Good, 1971 and ΔvapH° value of 49.03±0.2 kj/mol from missing citation.; DRB |
ΔfH°gas | 59.7 ± 2.0 | kJ/mol | N/A | Stull, Sinke, et al., 1961 | Value computed using ΔfHliquid° value of 10.7±2 kj/mol from Stull, Sinke, et al., 1961 and ΔvapH° value of 49.03±0.2 kj/mol from missing citation.; DRB |
Constant pressure heat capacity of gas
Cp,gas (J/mol*K) | Temperature (K) | Reference | Comment |
---|---|---|---|
38.85 | 50. | Dorofeeva O.V., 1989 | GT |
50.43 | 100. | ||
65.21 | 150. | ||
84.35 | 200. | ||
118.32 | 273.15 | ||
130.7 ± 1.0 | 298.15 | ||
131.67 | 300. | ||
180.16 | 400. | ||
221.92 | 500. | ||
255.92 | 600. | ||
283.54 | 700. | ||
306.26 | 800. | ||
325.20 | 900. | ||
341.14 | 1000. | ||
354.66 | 1100. | ||
366.17 | 1200. | ||
376.03 | 1300. | ||
384.51 | 1400. | ||
391.82 | 1500. |
Constant pressure heat capacity of gas
Cp,gas (J/mol*K) | Temperature (K) | Reference | Comment |
---|---|---|---|
193.64 ± 0.39 | 435.65 | Hossenlopp I.A., 1981 | GT |
199.15 ± 0.39 | 448.15 | ||
209.22 ± 0.39 | 473.15 | ||
219.20 ± 0.39 | 498.15 | ||
228.37 ± 0.39 | 523.15 |

Condensed phase thermochemistry data

Data compiled as indicated in comments:
DRB - Donald R. Burgess, Jr.
ALS - Hussein Y. Afeefy, Joel F. Liebman, and Stephen E. Stein
DH - Eugene S. Domalski and Elizabeth D. Hearing
Quantity | Value | Units | Method | Reference | Comment |
---|---|---|---|---|---|
ΔfH°liquid | 11.7 ± 1.8 | kJ/mol | Review | Roux, Temprado, et al., 2008 | There are sufficient high-quality literature values to make a good evaluation with a high degree of confidence. In general, the evaluated uncertainty limits are on the order of (0.5 to 2.5) kJ/mol.; DRB |
ΔfH°liquid | 11.7 ± 1.5 | kJ/mol | Ccb | Good, 1971 | ALS |
ΔfH°liquid | 10.7 ± 2.0 | kJ/mol | Ccb | Stull, Sinke, et al., 1961 | see Stull, Sinke, et al., 1959; ALS |
Quantity | Value | Units | Method | Reference | Comment |
ΔcH°liquid | -4982.5 ± 1.4 | kJ/mol | Ccb | Good, 1971 | Corresponding ΔfHºliquid = 11.7 kJ/mol (simple calculation by NIST; no Washburn corrections); ALS |
ΔcH°liquid | -4981.6 ± 2.0 | kJ/mol | Ccb | Stull, Sinke, et al., 1961 | see Stull, Sinke, et al., 1959; Corresponding ΔfHºliquid = 10.8 kJ/mol (simple calculation by NIST; no Washburn corrections); ALS |
Quantity | Value | Units | Method | Reference | Comment |
S°liquid | 234.35 | J/mol*K | N/A | Stull, Sinke, et al., 1961 | DH |
S°liquid | 234.34 | J/mol*K | N/A | Stull, Sinke, et al., 1959, 2 | DH |
Constant pressure heat capacity of liquid
Cp,liquid (J/mol*K) | Temperature (K) | Reference | Comment |
---|---|---|---|
190.25 | 298.15 | Stull, Sinke, et al., 1961 | T = 15 to 320 K. Premelting occurs at 170 K to melting.; DH |
190.25 | 298.15 | Stull, Sinke, et al., 1959, 2 | T = 15 to 320 K.; DH |

Phase change data

Data compiled as indicated in comments:
BS - Robert L. Brown and Stephen E. Stein
TRC - Thermodynamics Research Center, NIST Boulder Laboratories, Chris Muzny director
DRB - Donald R. Burgess, Jr.
AC - William E. Acree, Jr., James S. Chickos
ALS - Hussein Y. Afeefy, Joel F. Liebman, and Stephen E. Stein
DH - Eugene S. Domalski and Elizabeth D. Hearing
Quantity | Value | Units | Method | Reference | Comment |
---|---|---|---|---|---|
Tboil | 450. ± 2. | K | AVG | N/A | Average of 9 values; Individual data points |
Quantity | Value | Units | Method | Reference | Comment |
Tfus | 221.46 | K | N/A | Boord, Perilstein, et al., 1944 | Uncertainty assigned by TRC = 0.4 K; TRC |
Quantity | Value | Units | Method | Reference | Comment |
Ttriple | 221.77 | K | N/A | Stull, Sinke, et al., 1959, 3 | Uncertainty assigned by TRC = 0.02 K; TRC |
Quantity | Value | Units | Method | Reference | Comment |
Tc | 684.9 ± 0.5 | K | N/A | Tsonopoulos and Ambrose, 1995 | |
Tc | 684.9 | K | N/A | Majer and Svoboda, 1985 | |
Tc | 684.9 | K | N/A | Ambrose, Broderick, et al., 1974 | Uncertainty assigned by TRC = 0.4 K; TRC |
Quantity | Value | Units | Method | Reference | Comment |
Pc | 39.5 ± 0.4 | bar | N/A | Tsonopoulos and Ambrose, 1995 | |
Pc | 39.50 | bar | N/A | Ambrose, Broderick, et al., 1974 | Uncertainty assigned by TRC = 0.30 bar; TRC |
Quantity | Value | Units | Method | Reference | Comment |
ΔvapH° | 48.8 | kJ/mol | N/A | Majer and Svoboda, 1985 | |
ΔvapH° | 49.2 ± 1.0 | kJ/mol | Review | Roux, Temprado, et al., 2008 | There are sufficient high-quality literature values to make a good evaluation with a high degree of confidence. In general, the evaluated uncertainty limits are on the order of (0.5 to 2.5) kJ/mol.; DRB |
ΔvapH° | 49.0 | kJ/mol | C | Hossenlopp and Scott, 1981 | AC |
ΔvapH° | 49.03 ± 0.20 | kJ/mol | V | Osborn and Scott, 1978 | ALS |
Enthalpy of vaporization
ΔvapH (kJ/mol) | Temperature (K) | Method | Reference | Comment |
---|---|---|---|---|
39.63 | 451. | N/A | Majer and Svoboda, 1985 | |
44.0 | 389. | A | Stephenson and Malanowski, 1987 | Based on data from 374. to 466. K.; AC |
45.0 | 370. | N/A | Ambrose and Sprake, 1976 | Based on data from 355. to 482. K.; AC |
Enthalpy of vaporization
ΔvapH =
A exp(-βTr) (1 − Tr)β
ΔvapH =
Enthalpy of vaporization (at saturation pressure)
(kJ/mol)
Tr = reduced temperature (T / Tc)
View plot Requires a JavaScript / HTML 5 canvas capable browser.
Temperature (K) | A (kJ/mol) | β | Tc (K) | Reference | Comment |
---|---|---|---|---|---|
382. to 451. | 65.1 | 0.2866 | 684.9 | Majer and Svoboda, 1985 |
Enthalpy of fusion
ΔfusH (kJ/mol) | Temperature (K) | Reference | Comment |
---|---|---|---|
8.598 | 221.77 | Stull, Sinke, et al., 1959, 2 | DH |
8.6 | 221.8 | Domalski and Hearing, 1996 | AC |
Entropy of fusion
ΔfusS (J/mol*K) | Temperature (K) | Reference | Comment |
---|---|---|---|
38.77 | 221.77 | Stull, Sinke, et al., 1959, 2 | DH |
Enthalpy of phase transition
ΔHtrs (kJ/mol) | Temperature (K) | Initial Phase | Final Phase | Reference | Comment |
---|---|---|---|---|---|
0.781 | 73.82 | crystaline, II | crystaline, I | Stull, Sinke, et al., 1961 | DH |
8.598 | 221.77 | crystaline, I | liquid | Stull, Sinke, et al., 1961 | DH |
Entropy of phase transition
ΔStrs (J/mol*K) | Temperature (K) | Initial Phase | Final Phase | Reference | Comment |
---|---|---|---|---|---|
10.57 | 73.82 | crystaline, II | crystaline, I | Stull, Sinke, et al., 1961 | DH |
38.77 | 221.77 | crystaline, I | liquid | Stull, Sinke, et al., 1961 | DH |

Reaction thermochemistry data

Data compiled by: Hussein Y. Afeefy, Joel F. Liebman, and Stephen E. Stein
Individual Reactions
Quantity | Value | Units | Method | Reference | Comment |
---|---|---|---|---|---|
ΔrH° | -98.9 ± 1.4 | kJ/mol | Chyd | Hill, Morton, et al., 1980 | liquid phase |
ΔrH° | -96. | kJ/mol | Eqk | Frye and Weitkamp, 1969 | gas phase |
ΔrH° | -90.48 ± 0.59 | kJ/mol | Eqk | Naidus and Mueller, 1950 | gas phase; At 375-525 K |
By formula: 6H2 + 2C9H10 = C9H16 + C9H16
Quantity | Value | Units | Method | Reference | Comment |
---|---|---|---|---|---|
ΔrH° | -377.1 ± 2.1 | kJ/mol | Chyd | Dolliver, Gresham, et al., 1937 | gas phase; Reanalyzed by Cox and Pilcher, 1970, Original value = -383. ± 2. kJ/mol; At 355 °K |
By formula: 3H2 + C9H10 = C9H16
Quantity | Value | Units | Method | Reference | Comment |
---|---|---|---|---|---|
ΔrH° | -192. | kJ/mol | Eqk | Frye and Weitkamp, 1969 | gas phase |

Gas phase ion energetics data

Data compiled as indicated in comments:
LLK - Sharon G. Lias, Rhoda D. Levin, and Sherif A. Kafafi
RDSH - Henry M. Rosenstock, Keith Draxl, Bruce W. Steiner, and John T. Herron
Ionization energy determinations
IE (eV) | Method | Reference | Comment |
---|---|---|---|
8.6 ± 0.1 | EI | Koppel, Schwarz, et al., 1974 | LLK |
8.60 ± 0.01 | EI | Rakita, Hoffman, et al., 1973 | LLK |
8.52 | CTS | Pitt, 1970 | RDSH |
9.05 ± 0.05 | EI | Meier, Heiss, et al., 1968 | RDSH |
8.50 | PE | Santiago, Gandour, et al., 1978 | Vertical value; LLK |
8.46 ± 0.03 | PE | Heilbronner, Hoshi, et al., 1976 | Vertical value; LLK |
8.45 ± 0.02 | PE | Maier and Turner, 1973 | Vertical value; LLK |
8.46 | PE | Brogli, Giovannini, et al., 1973 | Vertical value; LLK |
Appearance energy determinations
Ion | AE (eV) | Other Products | Method | Reference | Comment |
---|---|---|---|---|---|
C9H9+ | 12.1 ± 0.1 | H | EI | Koppel, Schwarz, et al., 1974 | LLK |

Kovats' RI, non-polar column, isothermal

Column type | Active phase | Temperature (C) | I | Reference | Comment |
---|---|---|---|---|---|
Capillary | OV-101 | 150. | 1050.8 | Cha and Lee, 1994 | Column length: 20. m; Column diameter: 0.5 mm |
Capillary | OV-101 | 180. | 1066.7 | Cha and Lee, 1994 | Column length: 20. m; Column diameter: 0.5 mm |
Capillary | OV-101 | 0. | 982. | Skrbic and Vojinovic-Miloradov, 1994 | |
Capillary | OV-101 | 145. | 1059. | Grinberg, Tokarev, et al., 1984 | He; Column length: 50. m; Column diameter: 0.25 mm |
Capillary | OV-101 | 145. | 1058. | Grinberg, Tokarev, et al., 1984 | He; Column length: 100. m; Column diameter: 0.25 mm |
Capillary | Squalane | 106. | 1016. | Kugucheva and Mashinsky, 1983 | He; Column length: 100. m |
Capillary | Squalane | 96. | 1012. | Kugucheva and Mashinsky, 1983 | He; Column length: 100. m |
Capillary | SE-30 | 70. | 1015.7 | Tóth, 1983 | N2; Column length: 15. m; Column diameter: 0.25 mm |
Capillary | SE-30 | 130. | 1043. | Bredael, 1982 | Column length: 100. m; Column diameter: 0.5 mm |
Capillary | SE-30 | 150. | 1052. | Bredael, 1982 | Column length: 100. m; Column diameter: 0.5 mm |
Capillary | SE-30 | 80. | 1018. | Bredael, 1982 | Column length: 100. m; Column diameter: 0.5 mm |
Capillary | Squalane | 86. | 1011.2 | Macák, Nabivach, et al., 1982 | N2; Column length: 50. m; Column diameter: 0.25 mm |
Capillary | Squalane | 96. | 1014.5 | Macák, Nabivach, et al., 1982 | N2; Column length: 50. m; Column diameter: 0.25 mm |
Capillary | OV-101 | 100. | 1027.4 | Gerasimenko, Kirilenko, et al., 1981 | N2; Column length: 50. m; Column diameter: 0.3 mm |
Capillary | OV-101 | 120. | 1036.1 | Gerasimenko, Kirilenko, et al., 1981 | N2; Column length: 50. m; Column diameter: 0.3 mm |
Capillary | OV-101 | 140. | 1046.0 | Gerasimenko, Kirilenko, et al., 1981 | N2; Column length: 50. m; Column diameter: 0.3 mm |
Packed | Squalane | 100. | 1017. | Nabivach and Kirilenko, 1980 | He, Chromaton N-AW-HMDS; Column length: 1. m |
Capillary | Squalane | 86. | 1011.0 | Nabivach and Kirilenko, 1979 | N2; Column length: 50. m |
Capillary | Squalane | 86. | 1011.2 | Nabivach and Kirilenko, 1979 | N2; Column length: 50. m |
Capillary | Squalane | 100. | 1018. | Bogoslovsky, Anvaer, et al., 1978 | |
Capillary | Squalane | 110. | 1019. | Bogoslovsky, Anvaer, et al., 1978 | |
Capillary | Squalane | 90. | 1011. | Bogoslovsky, Anvaer, et al., 1978 | |
Capillary | Squalane | 92. | 1014. | Bogoslovsky, Anvaer, et al., 1978 | |
Capillary | Squalane | 86. | 1011.2 | Nabivach, Bur'yan, et al., 1978 | Column length: 50. m; Column diameter: 0.25 mm |
Capillary | Squalane | 96. | 1014.5 | Nabivach, Bur'yan, et al., 1978 | Column length: 50. m; Column diameter: 0.25 mm |
Packed | SE-30 | 110. | 1033. | Mitra, Mohan, et al., 1974 | N2, Chrom W; Column length: 6.1 m |
Capillary | Squalane | 100. | 1018. | Mitra, Mohan, et al., 1974, 2 | H2; Column length: 50. m; Column diameter: 0.2 mm |
Capillary | SE-30 | 65. | 1011.8 | Svob and Deur-Siftar, 1974 | He; Column length: 25.5 m; Column diameter: 0.5 mm |

Kovats' RI, non-polar column, temperature ramp

Column type | Active phase | I | Reference | Comment |
---|---|---|---|---|
Capillary | DB-5 | 1051. | Buchin, Salmon, et al., 2002 | 60. m/0.32 mm/1. μm, He, 40. C @ 5. min, 3. K/min, 230. C @ 2. min |
Capillary | DB-5 | 1034.0 | Wang, Fingas, et al., 1994 | 30. m/0.32 mm/0.25 μm, He, 50. C @ 2. min, 6. K/min; Tend: 300. C |
Capillary | OV-101 | 1013. | Hayes and Pitzer, 1982 | 110. m/0.25 mm/0.20 μm, He, 1. K/min; Tstart: 35. C; Tend: 200. C |
Capillary | Apiezon L | 1058. | Louis, 1971 | N2, 1. K/min; Column length: 50. m; Column diameter: 0.25 mm; Tstart: 60. C |

Kovats' RI, non-polar column, custom temperature program

Column type | Active phase | I | Reference | Comment |
---|---|---|---|---|
Capillary | Petrocol DH-100 | 1019.45 | Haagen-Smit Laboratory, 1997 | He; Column length: 100. m; Column diameter: 0.2 mm; Program: 5C(10min) => 5C/min => 50C(48min) => 1.5C/min => 195C(91min) |
Capillary | DB-1 | 1022. | Hoekman, 1993 | 60. m/0.32 mm/1.0 μm, He; Program: -40 C for 12 min; -40 - 125 C at 3 deg.min; 125-185 C at 6 deg/min; 185 - 220 C at 20 deg/min; hold 220 C for 2 min |

Kovats' RI, polar column, isothermal

Column type | Active phase | Temperature (C) | I | Reference | Comment |
---|---|---|---|---|---|
Capillary | PEG-20M | 70. | 1355.9 | Tóth, 1983 | N2; Column length: 30. m; Column diameter: 0.3 mm |

Van Den Dool and Kratz RI, non-polar column, temperature ramp

Column type | Active phase | I | Reference | Comment |
---|---|---|---|---|
Capillary | PONA | 1020. | Vendeuvre, Bertoncini, et al., 2005 | 50. m/0.2 mm/0.5 μm, 2. K/min; Tstart: 50. C |
Capillary | PONA | 1030. | Vendeuvre, Bertoncini, et al., 2005 | 50. m/0.2 mm/0.5 μm, 5. K/min; Tstart: 50. C |
Capillary | Petrocol DH | 1024.5 | Censullo, Jones, et al., 2003 | 50. m/0.25 mm/0.5 μm, He, 35. C @ 10. min, 3. K/min, 200. C @ 10. min |
Capillary | DB-5 | 1027.4 | Song, Lai, et al., 2003 | 30. m/0.25 mm/0.25 μm, He, 2. K/min; Tstart: 40. C; Tend: 310. C |
Capillary | DB-5 | 1032.4 | Song, Lai, et al., 2003 | 30. m/0.25 mm/0.25 μm, He, 4. K/min; Tstart: 40. C; Tend: 310. C |
Capillary | DB-5 | 1035.5 | Song, Lai, et al., 2003 | 30. m/0.25 mm/0.25 μm, He, 6. K/min; Tstart: 40. C; Tend: 310. C |
Capillary | DB-5 | 1047.8 | Xu, van Stee, et al., 2003 | 30. m/0.25 mm/1. μm, He, 2.5 K/min; Tstart: 50. C; Tend: 200. C |
Capillary | OV-1 | 1017.4 | Gautzsch and Zinn, 1996 | 8. K/min; Tstart: 35. C; Tend: 300. C |
Capillary | DB-5 | 1027.4 | Lai and Song, 1995 | 30. m/0.25 mm/0.25 μm, He, 2. K/min; Tstart: 40. C; Tend: 310. C |
Capillary | DB-5 | 1032.4 | Lai and Song, 1995 | 30. m/0.25 mm/0.25 μm, He, 4. K/min; Tstart: 40. C; Tend: 310. C |
Capillary | DB-5 | 1035.5 | Lai and Song, 1995 | 30. m/0.25 mm/0.25 μm, He, 6. K/min; Tstart: 40. C; Tend: 310. C |
Capillary | Petrocol DH | 1015.41 | White, Douglas, et al., 1992 | 100. m/0.25 mm/0.5 μm, He, 1. K/min; Tstart: 30. C; Tend: 220. C |
Capillary | Petrocol DH | 1015.61 | White, Douglas, et al., 1992 | 100. m/0.25 mm/0.5 μm, He, 1. K/min; Tstart: 30. C; Tend: 220. C |
Capillary | Petrocol DH | 1016. | White, Hackett, et al., 1992 | 100. m/0.25 mm/0.5 μm, He, 1. K/min; Tstart: 30. C; Tend: 220. C |
Capillary | DB-5 | 1028. | Morinaga, Hara, et al., 1990 | 15. m/0.53 mm/1.5 μm, He, 4. K/min; Tstart: 40. C; Tend: 90. C |
Capillary | DB-5 | 1036. | Rostad and Pereira, 1986 | 30. m/0.26 mm/0.25 μm, He, 50. C @ 4. min, 6. K/min, 300. C @ 20. min |
Capillary | Ultra-1 | 1007.28 | Haynes and Pitzer, 1985 | 50. m/0.22 mm/0.33 μm, He, 1. K/min; Tstart: -30. C; Tend: 240. C |
Capillary | Ultra-1 | 1013.03 | Haynes and Pitzer, 1985 | 50. m/0.22 mm/0.33 μm, He, 2. K/min; Tstart: -30. C; Tend: 240. C |
Capillary | Ultra-1 | 1016.71 | Haynes and Pitzer, 1985 | 50. m/0.22 mm/0.33 μm, He, 3. K/min; Tstart: -30. C; Tend: 240. C |
Capillary | Ultra-2 | 1030.81 | Haynes and Pitzer, 1985 | 50. m/0.22 mm/0.33 μm, He, 1. K/min; Tstart: -30. C; Tend: 240. C |
Capillary | Ultra-2 | 1036.70 | Haynes and Pitzer, 1985 | 50. m/0.22 mm/0.33 μm, He, 2. K/min; Tstart: -30. C; Tend: 240. C |
Capillary | Ultra-2 | 1041.08 | Haynes and Pitzer, 1985 | 50. m/0.22 mm/0.33 μm, He, 3. K/min; Tstart: -30. C; Tend: 240. C |
Capillary | OV-101 | 1013. | Hayes and Pitzer, 1981 | 108. m/0.25 mm/0.2 μm, 1. K/min; Tstart: 35. C; Tend: 200. C |

Van Den Dool and Kratz RI, non-polar column, custom temperature program

Column type | Active phase | I | Reference | Comment |
---|---|---|---|---|
Capillary | Methyl Silicone | 1039.25 | Hassoun, Pilling, et al., 1999 | 50. m/0.25 mm/1. μm, He; Program: -50C(2min) => 49.9C/min => 35C(10min) => 3C/min => 200C(2min) => 40C/min => 240C(30min) |
Packed | SE-30 | 1038. | Peng, Ding, et al., 1988 | Supelcoport; Chromosorb; Column length: 3.05 m; Program: 40C(5min) => 10C/min => 200C or 250C (60min) |

Van Den Dool and Kratz RI, polar column, temperature ramp

Column type | Active phase | I | Reference | Comment |
---|---|---|---|---|
Capillary | Supelcowax-10 | 1382. | Elmore, Nisyrios, et al., 2005 | 60. m/0.25 mm/0.25 μm, He, 40. C @ 2. min, 4. K/min; Tend: 280. C |
Capillary | DB-Wax | 1365. | Shiratsuchi, Shimoda, et al., 1994 | 60. m/0.25 mm/0.25 μm, He, 2. K/min, 230. C @ 60. min; Tstart: 50. C |

Normal alkane RI, non-polar column, isothermal

Column type | Active phase | Temperature (C) | I | Reference | Comment |
---|---|---|---|---|---|
Capillary | OV-101 | 120. | 1046. | Nabivach and Gerasimenko, 1996 | |
Capillary | OV-101 | 100. | 1027. | Tian, 1993 | Column length: 50. m; Column diameter: 0.20 mm |
Capillary | OV-101 | 100. | 1027. | Tian, 1993 | Column length: 50. m; Column diameter: 0.20 mm |
Capillary | OV-101 | 120. | 1036. | Tian, 1993 | Column length: 50. m; Column diameter: 0.20 mm |
Capillary | OV-101 | 120. | 1036. | Tian, 1993 | Column length: 50. m; Column diameter: 0.20 mm |
Capillary | Squalane | 110. | 1019. | Papazova and Pankova, 1975 | N2; Column length: 100. m; Column diameter: 0.25 mm |
Packed | Polydimethyl siloxane | 110. | 1032. | Ferrand, 1962 |

Normal alkane RI, non-polar column, temperature ramp

Column type | Active phase | I | Reference | Comment |
---|---|---|---|---|
Capillary | Polydimethyl siloxane: CP-Sil 5 CB | 1026. | Bramston-Cook, 2013 | 60. m/0.25 mm/1.0 μm, Helium, 45. C @ 1.45 min, 3.6 K/min, 210. C @ 2.72 min |
Capillary | HP-5 MS | 1029. | Kotowska, Zalikowski, et al., 2012 | 30. m/0.25 mm/0.25 μm, Helium, 35. C @ 5. min, 3. K/min, 300. C @ 15. min |
Capillary | Petrocol DH | 1020. | Supelco, 2012 | 100. m/0.25 mm/0.50 μm, Helium, 20. C @ 15. min, 15. K/min, 220. C @ 30. min |
Capillary | Petrocol DH | 1023. | Supelco, 2012 | 100. m/0.25 mm/0.50 μm, Helium, 20. C @ 15. min, 15. K/min, 220. C @ 30. min |
Capillary | PONA | 1027. | Zhang, Ding, et al., 2009 | 50. m/0.20 mm/0.50 μm, Nitrogen, 35. C @ 15. min, 2. K/min, 200. C @ 10. min |
Capillary | RTX-1 | 1002. | Arey J.S., Nelson R.K., et al., 2005 | 7. m/0.1 mm/0.4 μm, 35. C @ 5. min, 0.66 K/min; Tend: 180. C |
Capillary | BP-1 | 1033. | Health Safety Executive, 2000 | 50. m/0.22 mm/0.75 μm, He, 5. K/min; Tstart: 50. C; Tend: 200. C |
Capillary | OV-1 | 1017. | Orav, Kailas, et al., 1999 | 2. K/min; Tstart: 50. C; Tend: 160. C |
Capillary | Ultra-1 | 1022. | Elizalde-González, Hutfliess, et al., 1996 | 50. m/0.2 mm/0.33 μm, H2, 3. K/min, 300. C @ 35. min; Tstart: 60. C |
Capillary | DB-1 | 1029. | Ciccioli, Cecinato, et al., 1992 | 60. m/0.32 mm/1.2 μm, He, 30. C @ 10. min, 3. K/min; Tend: 240. C |

Normal alkane RI, non-polar column, custom temperature program

Column type | Active phase | I | Reference | Comment |
---|---|---|---|---|
Capillary | HP-5 MS | 1034. | Kotowska, Zalikowski, et al., 2012 | 30. m/0.25 mm/0.25 μm, Helium; Program: not specified |
Capillary | Polydimethyl siloxane with 5 % Ph groups | 1041. | Robinson, Adams, et al., 2012 | Program: not specified |
Capillary | Polydimethyl siloxane with 5 % Ph groups | 1048. | Robinson, Adams, et al., 2012 | Program: not specified |
Capillary | Polymethylsiloxane, (PMS-20000) | 1016. | Cornwell and Cordano, 2003 | Program: not specified |
Capillary | DB-1 | 1013. | Ciccioli, Cecinato, et al., 1994 | 60. m/0.32 mm/0.25 μm; Program: not specified |
Capillary | DB-1 | 1013. | Ciccioli, Brancaleoni, et al., 1993 | 60. m/0.32 mm/0.25 μm; Program: 3 min at 5 C; 5 - 50 C at 3 deg/min; 50 - 220 C at 5 deg/min |
Capillary | Polydimethyl siloxane, unknown content of Ph-groups | 1036. | Geldon, 1989 | Program: not specified |
Capillary | Polydimethyl siloxane, unknown content of Ph-groups | 1040. | Geldon, 1989 | Program: not specified |
Capillary | OV-1, SE-30, Methyl silicone, SP-2100, OV-101, DB-1, etc. | 1014. | Waggott and Davies, 1984 | Hydrogen; Column length: 50. m; Column diameter: 0.32 mm; Program: not specified |
Capillary | OV-1, SE-30, Methyl silicone, SP-2100, OV-101, DB-1, etc. | 1018. | Waggott and Davies, 1984 | Hydrogen; Column length: 50. m; Column diameter: 0.32 mm; Program: not specified |
Capillary | OV-1, SE-30, Methyl silicone, SP-2100, OV-101, DB-1, etc. | 1021. | Waggott and Davies, 1984 | Hydrogen; Column length: 50. m; Column diameter: 0.32 mm; Program: not specified |

Normal alkane RI, polar column, temperature ramp

Column type | Active phase | I | Reference | Comment |
---|---|---|---|---|
Capillary | Innowax | 1370. | Siristova, Prinosilova, et al., 2012 | 30. m/0.25 mm/0.25 μm, Helium, 40. C @ 1. min, 8. K/min, 250. C @ 2.75 min |

Normal alkane RI, polar column, custom temperature program

Column type | Active phase | I | Reference | Comment |
---|---|---|---|---|
Capillary | Carbowax 20M | 1356. | Cornwell and Cordano, 2003 | Program: not specified |
Capillary | DB-Wax | 1365. | Peng, Yang, et al., 1991 | Program: not specified |
Capillary | DB-Wax | 1377. | Peng, Yang, et al., 1991 | Program: not specified |

Lee's RI, non-polar column, temperature ramp

Column type | Active phase | I | Reference | Comment |
---|---|---|---|---|
Capillary | DB-5MS | 169.04 | Chen, Keeran, et al., 2002 | 30. m/0.25 mm/0.5 μm, 40. C @ 1. min, 10. K/min; Tend: 310. C |
Capillary | DB-5 | 169.1 | Durlak, Biswas, et al., 1998 | 30. m/0.25 mm/0.25 μm, 15. K/min; Tstart: 50. C; Tend: 300. C |
Capillary | HT-5 | 168.83 | Williams and Williams, 1998 | 40. C @ 8. min, 5. K/min, 400. C @ 20. min; Column length: 25. m; Column diameter: 0.32 mm |
Capillary | DB-5 | 170.21 | Williams and Horne, 1995 | He, 60. C @ 2. min, 5. K/min; Column length: 25. m; Column diameter: 0.3 mm; Tend: 270. C |
Capillary | DB-5 | 168.87 | Rostad and Pereira, 1986 | 30. m/0.26 mm/0.25 μm, He, 50. C @ 4. min, 6. K/min, 300. C @ 20. min |

Lee's RI, non-polar column, custom temperature program

Column type | Active phase | I | Reference | Comment |
---|---|---|---|---|
Capillary | DB-5 | 165.5 | Fuentes, Font, et al., 2007 | Column length: 60. m; Program: not specified |
Capillary | HP-5MS | 167.82 | Cheng, Liu, et al., 2005 | 30. m/0.30 mm/0.25 μm, He; Program: 50 0C (2 min) 8 0C/min -> 120 0C (3 min) 10 0C/min -> 230 0C |
Capillary | Methyl Silicone | 168.87 | Eckel, Ross, et al., 1993 | Program: not specified |
Capillary | Methyl Silicone | 169.87 | Eckel, Ross, et al., 1993 | Program: not specified |

References

Roux, Temprado, et al., 2008
Roux, M.V.; Temprado, M.; Chickos, J.S.; Nagano, Y.,
Critically Evaluated Thermochemical Properties of Polycyclic Aromatic Hydrocarbons,
J. Phys. Chem. Ref. Data, 2008, 37, 4, 1855-1996. [all data]
Good, 1971
Good, W.D.,
The enthalpies of combustion and formation of indan and seven alkylindans,
J. Chem. Thermodyn., 1971, 3, 711-717. [all data]
Stull, Sinke, et al., 1961
Stull, D.R.; Sinke, G.C.; McDonald, R.A.; Hatton, W.E.; Hildenbrand, D.L.,
Thermodynamic properties of indane and indene,
Pure & Appl. Chem., 1961, 2, 315-322. [all data]
Dorofeeva O.V., 1989
Dorofeeva O.V.,
Thermodynamic Properties of Gaseous Polycyclic Aromatic Hydrocarbons Containing Five-Membered Rings. Institute for High Temperatures, USSR Academy of Sciences, Preprint No.1-263 (in Russian), Moscow, 1989. [all data]
Hossenlopp I.A., 1981
Hossenlopp I.A.,
Vapor heat capacities and enthalpies of vaporization of four aromatic and/or cycloalkane hydrocarbons,
J. Chem. Thermodyn., 1981, 13, 423-428. [all data]
Stull, Sinke, et al., 1959
Stull, D.R.; Sinke, G.C.; McDonald, R.A.; Hatton, W.E.; Hildenbrand, D.L.,
Thermodynamic properties of indane and indene,
Symposium uber Thermodynamik, 1959, 1-9. [all data]
Stull, Sinke, et al., 1959, 2
Stull, D.R.; Sinke, G.C.; McDonald, R.A.; Hatton, W.E.; Hildenbrand, D.L.,
Thermodynamic properties of indane and indene, Symp. Thermodynam. Fritens-Wattens,
Tirol Austria, 1959, No. 48, 9p. [all data]
Boord, Perilstein, et al., 1944
Boord, C.E.; Perilstein, W.L.; Greenlee, K.W.,
, Am. Pet. Inst. Hydrocarbon Res. Proj., Sixth Annu. Ref., Ohio State Univ., Aug. 31, 1944. [all data]
Stull, Sinke, et al., 1959, 3
Stull, D.R.; Sinke, G.C.; McDonald, R.A.; Hatton, W.E.; Hildenbrand, D.L.,
Thermodynamic properties of indane and indene
in Symp. Thermodyn. Fritens-Wattens, Tirol, Austria, 1959. [all data]
Tsonopoulos and Ambrose, 1995
Tsonopoulos, C.; Ambrose, D.,
Vapor-Liquid Critical Properties of Elements and Compounds. 3. Aromatic Hydrocarbons,
J. Chem. Eng. Data, 1995, 40, 547-558. [all data]
Majer and Svoboda, 1985
Majer, V.; Svoboda, V.,
Enthalpies of Vaporization of Organic Compounds: A Critical Review and Data Compilation, Blackwell Scientific Publications, Oxford, 1985, 300. [all data]
Ambrose, Broderick, et al., 1974
Ambrose, D.; Broderick, B.E.; Townsend, R.,
The Critical Temperatures and Pressures of Thirty Organic Compounds,
J. Appl. Chem. Biotechnol., 1974, 24, 359. [all data]
Hossenlopp and Scott, 1981
Hossenlopp, I.A.; Scott, D.W.,
Vapor heat capacities and enthalpies of vaporization of four aromatic and/or cycloalkane hydrocarbons,
J. Chem. Thermodyn., 1981, 13, 423-428. [all data]
Osborn and Scott, 1978
Osborn, A.G.; Scott, D.W.,
J. Chem. Thermodyn., 1978, 10, 619. [all data]
Stephenson and Malanowski, 1987
Stephenson, Richard M.; Malanowski, Stanislaw,
Handbook of the Thermodynamics of Organic Compounds, 1987, https://doi.org/10.1007/978-94-009-3173-2
. [all data]
Ambrose and Sprake, 1976
Ambrose, D.; Sprake, C.H.S.,
The vapour pressure of indane,
The Journal of Chemical Thermodynamics, 1976, 8, 6, 601-602, https://doi.org/10.1016/0021-9614(76)90033-1
. [all data]
Domalski and Hearing, 1996
Domalski, Eugene S.; Hearing, Elizabeth D.,
Heat Capacities and Entropies of Organic Compounds in the Condensed Phase. Volume III,
J. Phys. Chem. Ref. Data, 1996, 25, 1, 1, https://doi.org/10.1063/1.555985
. [all data]
Hill, Morton, et al., 1980
Hill, R.K.; Morton, G.H.; Rogers, D.W.; Choi, L.S.,
Rearrangement of 1,1'-spirobiindene and thermochemical evidence for its spiroconjugative destabilization,
J. Org. Chem., 1980, 45, 5163-5166. [all data]
Frye and Weitkamp, 1969
Frye, C.G.; Weitkamp, A.W.,
Equilibrium hydrogenations of multi-ring aromatics,
J. Chem. Eng. Data, 1969, 14, 372-376. [all data]
Naidus and Mueller, 1950
Naidus, E.S.; Mueller, M.B.,
Equilibrium studies on the hydrindene-indene-hydrogen system,
J. Am. Chem. Soc., 1950, 72, 1829-1831. [all data]
Dolliver, Gresham, et al., 1937
Dolliver, M.a.; Gresham, T.L.; Kistiakowsky, G.B.; Vaughan, W.E.,
Heats of organic reactions. V. Heats of hydrogenation of various hydrocarbons,
J. Am. Chem. Soc., 1937, 59, 831-841. [all data]
Cox and Pilcher, 1970
Cox, J.D.; Pilcher, G.,
Thermochemistry of Organic and Organometallic Compounds, Academic Press, New York, 1970, 1-636. [all data]
Koppel, Schwarz, et al., 1974
Koppel, C.; Schwarz, H.; Bohlmann, F.,
Elektronenstossinduzierte fragmentierung von acetylenverbindungen. VIII. Struktur der stabilen und instabilen ionen[C9H9]+ aus isomeren C9H10- kohlenwasserstoffen,
Org. Mass Spectrom., 1974, 8, 25. [all data]
Rakita, Hoffman, et al., 1973
Rakita, P.E.; Hoffman, M.K.; Andrews, M.N.; Bursey, M.M.,
σ-π Conjugation in group IVA compounds of indene and indane,
J. Organomet. Chem., 1973, 49, 213. [all data]
Pitt, 1970
Pitt, C.G.,
Hyperconjugation: An alternative to the concept of the pπ-dπ bond in Group IV chemistry,
J. Organomet. Chem., 1970, 23, 35. [all data]
Meier, Heiss, et al., 1968
Meier, H.; Heiss, J.; Suhr, H.; Muller, E.,
Energetische Untersuchungen zum Mills-Nixon-Effekt. Ionisierungsenergien von Benzolmolekulen mit ankondensierten gesattigten Ringen,
Tetrahedron, 1968, 24, 2307. [all data]
Santiago, Gandour, et al., 1978
Santiago, C.; Gandour, R.W.; Houk, K.N.; Nutakul, W.; Cravey, W.E.; Thummel, R.P.,
Photoelectron and ultraviolet spectra of small-ring fused aromatic molecules as probes of aromatic ring distortions,
J. Am. Chem. Soc., 1978, 100, 3730. [all data]
Heilbronner, Hoshi, et al., 1976
Heilbronner, E.; Hoshi, T.; von Rosenberg, J.L.; Hafner, K.,
Alkyl-induced, natural hypsochromic shifts of the 2A←2X and 2B←2X transitions of azulene and naphthalene radical cations,
Nouv. J. Chim., 1976, 1, 105. [all data]
Maier and Turner, 1973
Maier, J.P.; Turner, D.W.,
Steric inhibition of resonance studied by molecular photoelectron spectroscopy. Part 2. Phenylethylenes,
J. Chem. Soc. Faraday Trans. 2, 1973, 69, 196. [all data]
Brogli, Giovannini, et al., 1973
Brogli, F.; Giovannini, E.; Heilbronner, E.; Schurter, R.,
Die photoelektronen spektren der benzocycloalkene,
Chem. Ber., 1973, 106, 961. [all data]
Entel, Ruof, et al., 1953
Entel, J.; Ruof, C.H.; Howard, H.C.,
Preparation and properties of some methylated indans,
Anal. Chem., 1953, 25, 9, 1303-1310. [all data]
Cha and Lee, 1994
Cha, K.-W.; Lee, D.-J.,
Prediction of retention indices of various compounds in gas-liquid chromatography,
J. Korean Chem. Soc., 1994, 38, 2, 108-120, retrieved from http://journal.kcsnet.or.kr/publi/dh/dh94n2/108.pdf. [all data]
Skrbic and Vojinovic-Miloradov, 1994
Skrbic, B.D.; Vojinovic-Miloradov, M.B.,
A contribution to the qualitative GC analysis of some non-chlorinated xenobiotic chemicals in waste waters,
Water Sci. Technol., 1994, 30, 3, 91-93. [all data]
Grinberg, Tokarev, et al., 1984
Grinberg, A.A.; Tokarev, M.I.; Bigdash, T.V.; Kogan, L.O.; Leont'eva, S.A.,
Special features of using Kovats retention indices in chromatomass spectrometric analysis,
Zh. Anal. Khim., 1984, 39, 6, 909-911. [all data]
Kugucheva and Mashinsky, 1983
Kugucheva, E.E.; Mashinsky, V.I.,
Retention Indices of Aromatic Hydrocarbons on Capillary Columns with Squalan and Polyphenyl Ether,
Zh. Anal. Khim. (Rus), 1983, 38, 11, 2023-2026. [all data]
Tóth, 1983
Tóth, T.,
Use of capillary gas chromatography in collecting retention and chemical information for the analysis of complex petrochemical mixtures,
J. Chromatogr., 1983, 279, 157-165, https://doi.org/10.1016/S0021-9673(01)93614-3
. [all data]
Bredael, 1982
Bredael, P.,
Retention indices of hydrocarbons on SE-30,
J. Hi. Res. Chromatogr. Chromatogr. Comm., 1982, 5, 6, 325-328, https://doi.org/10.1002/jhrc.1240050610
. [all data]
Macák, Nabivach, et al., 1982
Macák, J.; Nabivach, V.; Buryan, P.; Sindler, S.,
Dependence of retention indices of alkylbenzenes on their molecular structure,
J. Chromatogr., 1982, 234, 2, 285-302, https://doi.org/10.1016/S0021-9673(00)81867-1
. [all data]
Gerasimenko, Kirilenko, et al., 1981
Gerasimenko, V.A.; Kirilenko, A.V.; Nabivach, V.M.,
Capillary gas chromatography of aromatic compounds found in coal tar fractions,
J. Chromatogr., 1981, 208, 1, 9-16, https://doi.org/10.1016/S0021-9673(00)87953-4
. [all data]
Nabivach and Kirilenko, 1980
Nabivach, V.M.; Kirilenko, A.V.,
Relationship between the gas chromatographic behaviour and the molecular structure of hydrocarbon samples and various stationary phases. Part II. Correlation between the retention index, physicochemical properties and molecular structure,
Chromatographia, 1980, 13, 2, 93-100, https://doi.org/10.1007/BF02263060
. [all data]
Nabivach and Kirilenko, 1979
Nabivach, V.M.; Kirilenko, A.V.,
The use of retention indices for identifying the components of crude benzene,
Solid Fuel Chem. (Engl. Transl.), 1979, 13, 3, 82-87. [all data]
Bogoslovsky, Anvaer, et al., 1978
Bogoslovsky, Yu.N.; Anvaer, B.I.; Vigdergauz, M.S.,
Chromatographic constants in gas chromatography (in Russian), Standards Publ. House, Moscow, 1978, 192. [all data]
Nabivach, Bur'yan, et al., 1978
Nabivach, V.M.; Bur'yan, P.; Matsak, I.,
Retention indices of aromatic hydrocarbons on a squalane capillary column,
Zh. Anal. Khim., 1978, 33, 7, 1108-1113. [all data]
Mitra, Mohan, et al., 1974
Mitra, G.D.; Mohan, G.; Sinha, A.,
Advances in the utilization of the retention index system for characterizing hydrocarbons in complex mixtures by gas chromatography,
J. Chromatogr., 1974, 99, 215-230, https://doi.org/10.1016/S0021-9673(00)90857-4
. [all data]
Mitra, Mohan, et al., 1974, 2
Mitra, G.D.; Mohan, G.; Sinha, A.,
Gas chromatographic analysis of complex hydrocarbon mixtures,
J. Chromatogr. A, 1974, 91, 633-648, https://doi.org/10.1016/S0021-9673(01)97944-0
. [all data]
Svob and Deur-Siftar, 1974
Svob, V.; Deur-Siftar, D.,
Kovats Retention Indices in the Identification of Alkylbenzene Degradation Products,
J. Chromatogr., 1974, 91, 677-689, https://doi.org/10.1016/S0021-9673(01)97947-6
. [all data]
Buchin, Salmon, et al., 2002
Buchin, S.; Salmon, J.-C.; Carnat, A.-P.; Berger, T.; Bugaud, C.; Bosset, J.O.,
Identification de composés monoterpéniques, sesquiterpéniques et benzéniques dans un lait d'alpage très riche en ces substances,
Mitt. Lebensmittelunters. Hyg., 2002, 93, 199-216. [all data]
Wang, Fingas, et al., 1994
Wang, Z.; Fingas, M.; Li, K.,
Fractionation of a light crude oil and identification and quantitation of aliphatic, aromatic, and biomarker comopunds by GC-FID and GC-MS, Part II,
J. Chromatogr. Sci., 1994, 32, 9, 367-382, https://doi.org/10.1093/chromsci/32.9.367
. [all data]
Hayes and Pitzer, 1982
Hayes, P.C., Jr.; Pitzer, E.W.,
Characterizing petroleum- and shale-derived jet fuel distillates via temperature-programmed Kováts indices,
J. Chromatogr., 1982, 253, 179-198, https://doi.org/10.1016/S0021-9673(01)88376-X
. [all data]
Louis, 1971
Louis, R.,
Kovats-index-tafeln zur gaschromatographischen analyse von kohlenwasserstoffgemischen,
Erdoel Kohle Erdgas Petrochem., 1971, 24, 2, 88-94. [all data]
Haagen-Smit Laboratory, 1997
Haagen-Smit Laboratory,
Procedure for the detailed hydrocarbon analysis of gasolines by single column high efficiency (capillary) column gas chromatography, SOP NO. MLD 118, Revision No. 1.1, California Environmental Protection Agency, Air Resources Board, El Monte, California, 1997, 22. [all data]
Hoekman, 1993
Hoekman, S.K.,
Improved gas chromatography procedure for speciated hydrocarbon measurements of vehicle emissions,
J. Chromatogr., 1993, 639, 2, 239-253, https://doi.org/10.1016/0021-9673(93)80260-F
. [all data]
Vendeuvre, Bertoncini, et al., 2005
Vendeuvre, C.; Bertoncini, F.; Thiébaut, D.; Martin, M.; Hennion, M.-C.,
Evluation of a retention model in comprehensive two-dimensional gas chromatography,
J. Sep. Sci., 2005, 28, 11, 1129-1136, https://doi.org/10.1002/jssc.200401933
. [all data]
Censullo, Jones, et al., 2003
Censullo, A.C.; Jones, D.R.; Wills, M.T.,
Speciation of the volatile organic compounds (VOCs) in solventborne aerosol coatings by solid phase microextraction-gas chromatography,
J. Coat. Technol., 2003, 75, 936, 47-53, https://doi.org/10.1007/BF02697922
. [all data]
Song, Lai, et al., 2003
Song, C.; Lai, W.-C.; Madhusudan Reddy, K.; Wei, B.,
Chapter 7. Temperature-programmed retention indices for GC and GC-MS of hydrocarbon fuels and simulated distillation GC of heavy oils
in Analytical advances for hydrocarbon research, Hsu,C.S., ed(s)., Kluwer Academic/Plenum Publishers, New York, 2003, 147-193. [all data]
Xu, van Stee, et al., 2003
Xu, X.; van Stee, L.L.P.; Williams, J.; Beens, J.; Adahchour, M.; Vreuls, R.J.J.; Brinkman, U.A.Th.; Lelieveld, J.,
Comprehensive two-dimensional gas chromatography (GC×GC) measurements of volatile organic compounds in the atmosphere,
Atmos. Chem. Phys., 2003, 3, 3, 665-682, https://doi.org/10.5194/acp-3-665-2003
. [all data]
Gautzsch and Zinn, 1996
Gautzsch, R.; Zinn, P.,
Use of incremental models to estimate the retention indexes of aromatic compounds,
Chromatographia, 1996, 43, 3/4, 163-176, https://doi.org/10.1007/BF02292946
. [all data]
Lai and Song, 1995
Lai, W.-C.; Song, C.,
Temperature-programmed retention indices for g.c. and g.c.-m.s. analysis of coal- and petroleum-derived liquid fuels,
Fuel, 1995, 74, 10, 1436-1451, https://doi.org/10.1016/0016-2361(95)00108-H
. [all data]
White, Douglas, et al., 1992
White, C.M.; Douglas, L.J.; Hackett, J.P.; Anderson, R.R.,
Characterization of synthetic gasoline from the chloromethane-zeolite reaction,
Energy Fuels, 1992, 6, 1, 76-82, https://doi.org/10.1021/ef00031a012
. [all data]
White, Hackett, et al., 1992
White, C.M.; Hackett, J.; Anderson, R.R.; Kail, S.; Spock, P.S.,
Linear temperature programmed retention indices of gasoline range hydrocarbons and chlorinated hydrocarbons on cross-linked polydimethylsiloxane,
J. Hi. Res. Chromatogr., 1992, 15, 2, 105-120, https://doi.org/10.1002/jhrc.1240150211
. [all data]
Morinaga, Hara, et al., 1990
Morinaga, M.; Hara, K.; Kageura, M.; Heida, Y.; Takamoto, M.; Kashimura, S.,
A simple, rapid and simultaneous analysis of complex volatile hydrocarbon mixtures in blood using gas chromatography/mass spectrometry with a wide-bore capillary column,
Z. Rechtsmed., 1990, 103, 8, 567-572, https://doi.org/10.1007/BF01261420
. [all data]
Rostad and Pereira, 1986
Rostad, C.E.; Pereira, W.E.,
Kovats and Lee retention indices determined by gas chromatography/mass spectrometry for organic compounds of environmental interest,
J. Hi. Res. Chromatogr. Chromatogr. Comm., 1986, 9, 6, 328-334, https://doi.org/10.1002/jhrc.1240090603
. [all data]
Haynes and Pitzer, 1985
Haynes, P.C., Jr.; Pitzer, E.W.,
Disengaging solutes in shale- and petroleum-derived jet fuels by altering GC programmed temperature rates,
J. Hi. Res. Chromatogr. Chromatogr. Comm., 1985, 8, 5, 230-242, https://doi.org/10.1002/jhrc.1240080504
. [all data]
Hayes and Pitzer, 1981
Hayes, P.C., Jr.; Pitzer, E.W.,
Kovats indices as a tool in characterizing hydrocarbon fuels in temperature programmed glass capillary gas chromatography. Part 1. Qualitative identification, Inhouse rpt. for Air Force Wright Aeronautical Labs., Air Force Wright Aeronautical Labs., Wright-Patterson AFB, Ohio, 1981, 75. [all data]
Hassoun, Pilling, et al., 1999
Hassoun, S.; Pilling, M.J.; Bartle, K.D.,
A catalogue of urban hydrocarbons for the city of Leeds: atmospheric monitoring of volatile organic compounds by thermal desorption-gas chromatography,
J. Environ. Monitor., 1999, 1, 5, 453-458, https://doi.org/10.1039/a904879k
. [all data]
Peng, Ding, et al., 1988
Peng, C.T.; Ding, S.F.; Hua, R.L.; Yang, Z.C.,
Prediction of Retention Indexes I. Structure-Retention Index Relationship on Apolar Columns,
J. Chromatogr., 1988, 436, 137-172, https://doi.org/10.1016/S0021-9673(00)94575-8
. [all data]
Elmore, Nisyrios, et al., 2005
Elmore, J.S.; Nisyrios, I.; Mottram, D.S.,
Analysis of the headspace aroma compounds of walnuts (Juglans regia L.),
Flavour Fragr. J., 2005, 20, 5, 501-506, https://doi.org/10.1002/ffj.1477
. [all data]
Shiratsuchi, Shimoda, et al., 1994
Shiratsuchi, H.; Shimoda, M.; Imayoshi, K.; Noda, K.; Osajima, Y.,
Volatile flavor compounds in spray-dried skim milk powder,
J. Agric. Food Chem., 1994, 42, 4, 984-988, https://doi.org/10.1021/jf00040a028
. [all data]
Nabivach and Gerasimenko, 1996
Nabivach, V.M.; Gerasimenko, V.A.,
Gas chromatographic retention characteristics of bicyclic aromatic hydrocarbons,
Coke and Chemistry (Rus), 1996, 6, 27-31. [all data]
Tian, 1993
Tian, S.,
Analysis of the tower bottom oil of dimethylbenzene rectifying tower and C9 aromatic hydrocarbon fraction by capillary gas chromatography,
Chin. J. Chromatogr., 1993, 11, 4, 202-206. [all data]
Papazova and Pankova, 1975
Papazova, D.I.; Pankova, M.C.,
Identification of individual aromatic hydrocarbons in kerosene fraction (b.p. 150-250 °),
J. Chromatogr., 1975, 105, 2, 411-414, https://doi.org/10.1016/S0021-9673(01)82276-7
. [all data]
Ferrand, 1962
Ferrand, R.,
Gas phase chromatography using retention indices for the analysis of tars and their hydrogenation products,
Journees internationales d'etude des methodes de separation immediate at de chromatographie; Org. sur l'initiative du IX., 1962, 132-140. [all data]
Bramston-Cook, 2013
Bramston-Cook, R.,
Kovats indices for C2-C13 hydrocarbons and selected oxygenated/halocarbons with 100 % dimethylpolysiloxane columns, 2013, retrieved from http://lotusinstruments.com/monographs/List .... [all data]
Kotowska, Zalikowski, et al., 2012
Kotowska, U.; Zalikowski, M.; Isidorov, V.A.,
HS-SPME/GC-MS analysis of volatile and semi-volatile organic compounds emitted from municipal sewage sludge,
Environ. Monit. Asses., 2012, 184, 5, 2893-2907, https://doi.org/10.1007/s10661-011-2158-8
. [all data]
Supelco, 2012
Supelco, CatalogNo. 24160-U,
Petrocol DH Columns. Catalog No. 24160-U, 2012, retrieved from http://www.sigmaaldrich.com/etc/medialib/docs/Supelco/Datasheet/1/w97949.Par.0001.File.tmp/w97949.pdf. [all data]
Zhang, Ding, et al., 2009
Zhang, X.; Ding, L.; Sun, Z.; Song, L.; Sun, T.,
Study on quantitative structure-retention relationships for hydrocarbons in FCC gasoline,
Chromatographia, 2009, 70, 3/4, 511-518, https://doi.org/10.1365/s10337-009-1174-0
. [all data]
Arey J.S., Nelson R.K., et al., 2005
Arey J.S.; Nelson R.K.; Xu L.; Reddy C.M.,
Using comprehensive two-dimensional gas chromatography retention indices to estimate environmental partitioning properties for a complete set of diesel fuel hydrocarbons,
Anal. Chem., 2005, 77, 22, 7172-7182, https://doi.org/10.1021/ac051051n
. [all data]
Health Safety Executive, 2000
Health Safety Executive,
MDHS 96 Volatile organic compounds in air - Laboratory method using pumed solid sorbent tubes, solvent desorption and gas chromatography
in Methods for the Determination of Hazardous Substances (MDHS) guidance, Crown, Colegate, Norwich, 2000, 1-24, retrieved from http://www.hse.gov.uk/pubns/mdhs/pdfs/mdhs96.pdf. [all data]
Orav, Kailas, et al., 1999
Orav, A.; Kailas, T.; Muurisepp, M.; Kann, J.,
Composition of the oil from waste tires. 2. Fraction boiling at 160-180 0C,
Proc. Estonian Acad. Sci. Chem., 1999, 48, 3, 136-140. [all data]
Elizalde-González, Hutfliess, et al., 1996
Elizalde-González, M.P.; Hutfliess, M.; Hedden, K.,
Retention index system, adsorption characteristics, and sructure correlations of polycyclic aromatic hydrocarbons in fuels,
J. Hi. Res. Chromatogr., 1996, 19, 6, 345-352, https://doi.org/10.1002/jhrc.1240190608
. [all data]
Ciccioli, Cecinato, et al., 1992
Ciccioli, P.; Cecinato, A.; Brancaleoni, E.; Frattoni, M.; Liberti, A.,
Use of carbon adsorption traps combined with high resolution gas chromatography - mass spectrometry for the analysis of polar and non-polar C4-C14 hydrocarbons involved in photochemical smog formation,
J. Hi. Res. Chromatogr., 1992, 15, 2, 75-84, https://doi.org/10.1002/jhrc.1240150205
. [all data]
Robinson, Adams, et al., 2012
Robinson, A.L.; Adams, D.O.; Boss, P.K.; Heymann, H.; Solomon, P.S.; Trengove, R.D.,
Influence of geographic origine on the sensory characteristics and wine composition of Vitus viniferas cv. Cabernet Sauvignon wines from Australia (Supplemental data),
Am. J. Enol. Vitic., 2012, 64, 4, 467-476, https://doi.org/10.5344/ajev.2012.12023
. [all data]
Cornwell and Cordano, 2003
Cornwell, E.; Cordano, G.,
Nueva proposicion para predecir datos de retencion obtenidos mediante cromatografia de gases de hidrocarburos derivados de las naftas,
Revista de la Sociedad Quimica de Mexico, 2003, 47, 1, 38-43. [all data]
Ciccioli, Cecinato, et al., 1994
Ciccioli, P.; Cecinato, A.; Brancaleoni, E.; Brachetti, A.; Frattoni, M.; Sparapani, R.,
Composition and Distribution of Polar and Non-Polar VOCs in Urban, Rural, Forest and Remote Areas,
Eur Commission EUR, 1994, 549-568. [all data]
Ciccioli, Brancaleoni, et al., 1993
Ciccioli, P.; Brancaleoni, E.; Cecinato, A.; Sparapani, R.; Frattoni, M.,
Identification and determination of biogenic and anthropogenic volatile organic compounds in forest areas of Northern and Southern Europe and a remote site of the Himalaya region by high-resolution gas chromatography-mass spectrometry,
J. Chromatogr., 1993, 643, 1-2, 55-69, https://doi.org/10.1016/0021-9673(93)80541-F
. [all data]
Geldon, 1989
Geldon, A.L.,
Ground Water Hydrology of the Central Raton Basin, Colorado and New Mexico, US Geological Survey, US Government Printing Office, 1989, 104. [all data]
Waggott and Davies, 1984
Waggott, A.; Davies, I.W.,
Identification of organic pollutants using linear temperature programmed retention indices (LTPRIs) - Part II, 1984, retrieved from http://dwi.defra.gov.uk/research/completed-research/reports/dwi0383.pdf. [all data]
Siristova, Prinosilova, et al., 2012
Siristova, L.; Prinosilova, S.; Riddellova, K.; Hajslova, J.; Malzoch, K.,
Changes in quality parameters of vodka filtered through activated charcoal,
Czech J. Food Sci., 2012, 30, 5, 474-482. [all data]
Peng, Yang, et al., 1991
Peng, C.T.; Yang, Z.C.; Ding, S.F.,
Prediction of rentention idexes. II. Structure-retention index relationship on polar columns,
J. Chromatogr., 1991, 586, 1, 85-112, https://doi.org/10.1016/0021-9673(91)80028-F
. [all data]
Chen, Keeran, et al., 2002
Chen, P.H.; Keeran, W.S.; Van Ausdale, W.A.; Schindler, D.R.; Roberts, D.W.,
Application of Lee retention indices to the confirmation of tentatively identified compounds from GC/MS analysis of environmental samples, Technical paper, Analytical Services Division, Environmental ScienceEngineering, Inc, PO Box 1703, Gainesville, FL 32602, 2002, 11. [all data]
Durlak, Biswas, et al., 1998
Durlak, S.K.; Biswas, P.; Shi, J.; Bernhard, M.J.,
Characterization of polycyclic aromatic hydrocarbon particulate and gaseous emissions from polystyrene combustion,
Environ. Sci. Technol., 1998, 32, 15, 2301-2307, https://doi.org/10.1021/es9709031
. [all data]
Williams and Williams, 1998
Williams, P.T.; Williams, E.A.,
Recycling plastic waste by pyrolysis,
J. Inst. Energy, 1998, 71, 81-93. [all data]
Williams and Horne, 1995
Williams, P.T.; Horne, P.A.,
Analysis of aromatic hydrocarbons in pyrolytic oil derived from biomass,
J. Anal. Appl. Pyrolysis, 1995, 31, 15-37, https://doi.org/10.1016/0165-2370(94)00814-H
. [all data]
Fuentes, Font, et al., 2007
Fuentes, M.J.; Font, R.; Gomez-Rico, M.F.; Martin-Gullon, I.,
Pyrolysis and combustion of waste lubricant oil from diesel cars: Decomposition and pollutants,
J. Anal. Appl. Pyrolysis, 2007, 79, 1-2, 215-226, https://doi.org/10.1016/j.jaap.2006.12.004
. [all data]
Cheng, Liu, et al., 2005
Cheng, D.-X.; Liu, B.-X.; Sun, Y.-A.; Xie, B.; Zhang, H.-L.,
rapid analysis of pyrolysis products of cholesterol by GC-MS assited with boiling point - Lee retention index,
journal of Instrumental Analysis - Fenxi ceshi xuebao, 2005, 24, 6, 85-88. [all data]
Eckel, Ross, et al., 1993
Eckel, W.P.; Ross, B.; Isensee, R.K.,
Pentobarbital found in ground water,
Ground Water, 1993, 31, 5, 801-804, https://doi.org/10.1111/j.1745-6584.1993.tb00853.x
. [all data]