1,4-Butanedione, 1,4-diphenyl-
- Formula: C16H14O2
- Molecular weight: 238.2812
- IUPAC Standard InChIKey: OSWWFLDIIGGSJV-UHFFFAOYSA-N
- CAS Registry Number: 495-71-6
- Chemical structure:
View 3d structure (requires JavaScript / HTML 5) - Other names: 1,2-Dibenzoylethane; 1,4-Diphenyl-1,4-butanedione; 2,2''-Biacetophenone; Biphenacyl; Dibenzoylethane; Ethane, 1,2-dibenzoyl-

Condensed phase thermochemistry data

Data compiled as indicated in comments:
ALS - Hussein Y. Afeefy, Joel F. Liebman, and Stephen E. Stein
DH - Eugene S. Domalski and Elizabeth D. Hearing
Quantity | Value | Units | Method | Reference | Comment |
---|---|---|---|---|---|
ΔfH°solid | -255.6 ± 1.5 | kJ/mol | Ccb | Parks, Manchester, et al., 1954 | Reanalyzed by Cox and Pilcher, 1970, Original value = -256.2 ± 1.7 kJ/mol; ALS |
ΔfH°solid | -261. | kJ/mol | Ccb | Parks and Huffman, 1930 | Unpublished results T.R. Lumb; ALS |
Quantity | Value | Units | Method | Reference | Comment |
ΔcH°solid | -8041.4 ± 1.5 | kJ/mol | Ccb | Parks, Manchester, et al., 1954 | Reanalyzed by Cox and Pilcher, 1970, Original value = -8040.85 kJ/mol; Corresponding ΔfHºsolid = -255.6 kJ/mol (simple calculation by NIST; no Washburn corrections); ALS |
ΔcH°solid | -8036.2 | kJ/mol | Ccb | Parks and Huffman, 1930 | Unpublished results T.R. Lumb; Corresponding ΔfHºsolid = -261. kJ/mol (simple calculation by NIST; no Washburn corrections); ALS |
Quantity | Value | Units | Method | Reference | Comment |
S°solid,1 bar | 324.79 | J/mol*K | N/A | Parks and Huffman, 1930 | crystaline, I phase; Extrapolation below 90 K, 103.7 J/mol*K.; DH |
Constant pressure heat capacity of solid
Cp,solid (J/mol*K) | Temperature (K) | Reference | Comment |
---|---|---|---|
302.1 | 303. | Spaght, Thomas, et al., 1932 | T = 30 to 190°C.; DH |
291.2 | 296.0 | Parks and Huffman, 1930 | crystaline, I phase; T = 93 to 296 K. Value is unsmoothed experimental datum.; DH |

Phase change data

Data compiled as indicated in comments:
TRC - Thermodynamics Research Center, NIST Boulder Laboratories, Chris Muzny director
DH - Eugene S. Domalski and Elizabeth D. Hearing
AC - William E. Acree, Jr., James S. Chickos
CAL - James S. Chickos, William E. Acree, Jr., Joel F. Liebman, Students of Chem 202 (Introduction to the Literature of Chemistry), University of Missouri -- St. Louis
Quantity | Value | Units | Method | Reference | Comment |
---|---|---|---|---|---|
Tfus | 418.6 | K | N/A | Spaght, Thomas, et al., 1932, 2 | Uncertainty assigned by TRC = 0.2 K; TRC |
Enthalpy of fusion
ΔfusH (kJ/mol) | Temperature (K) | Reference | Comment |
---|---|---|---|
38.982 | 418.6 | Spaght, Thomas, et al., 1932 | DH |
38.99 | 418.6 | Domalski and Hearing, 1996 | AC |
Entropy of fusion
ΔfusS (J/mol*K) | Temperature (K) | Reference | Comment |
---|---|---|---|
93.1 | 418.6 | Spaght, Thomas, et al., 1932 | DH |
Entropy of fusion
ΔfusS (J/mol*K) | Temperature (K) | Reference | Comment |
---|---|---|---|
1.17 | 187. | Domalski and Hearing, 1996 | CAL |
93.3 | 418.6 |
Enthalpy of phase transition
ΔHtrs (kJ/mol) | Temperature (K) | Initial Phase | Final Phase | Reference | Comment |
---|---|---|---|---|---|
0.218 | 187. | crystaline, II | crystaline, I | Parks and Huffman, 1930 | DH |
Entropy of phase transition
ΔStrs (J/mol*K) | Temperature (K) | Initial Phase | Final Phase | Reference | Comment |
---|---|---|---|---|---|
1.17 | 187. | crystaline, II | crystaline, I | Parks and Huffman, 1930 | DH |

Gas phase ion energetics data

Data compiled by: Sharon G. Lias, Rhoda D. Levin, and Sherif A. Kafafi
Ionization energy determinations
IE (eV) | Method | Reference | Comment |
---|---|---|---|
9.2 ± 0.05 | PE | McAlduff and Bunbury, 1979 | Vertical value |

References

Parks, Manchester, et al., 1954
Parks, G.S.; Manchester, K.E.; Vaughan, L.M.,
Heats of combustion and formation of some alcohols, phenols, and ketones,
J. Chem. Phys., 1954, 22, 2089-2090. [all data]
Cox and Pilcher, 1970
Cox, J.D.; Pilcher, G.,
Thermochemistry of Organic and Organometallic Compounds, Academic Press, New York, 1970, 1-636. [all data]
Parks and Huffman, 1930
Parks, G.S.; Huffman, H.M.,
Thermal data on organic compounds. IX. A study of the effect of unsaturation on the heat capacities, entropies and free energies of some hydrocarbons and other compounds,
J. Am. Chem. Soc., 1930, 52, 4381-4391. [all data]
Spaght, Thomas, et al., 1932
Spaght, M.E.; Thomas, S.B.; Parks, G.S.,
Some heat capacity data on organic compounds obtained with a radiation calorimeter,
J. Phys. Chem., 1932, 36, 882-888. [all data]
Spaght, Thomas, et al., 1932, 2
Spaght, M.E.; Thomas, S.B.; Parks, G.S.,
Some heat capacity data on organic compounds obtained with a radiation calorimeter,
J. Phys. Chem., 1932, 36, 882-8. [all data]
Domalski and Hearing, 1996
Domalski, Eugene S.; Hearing, Elizabeth D.,
Heat Capacities and Entropies of Organic Compounds in the Condensed Phase. Volume III,
J. Phys. Chem. Ref. Data, 1996, 25, 1, 1, https://doi.org/10.1063/1.555985
. [all data]
McAlduff and Bunbury, 1979
McAlduff, E.J.; Bunbury, D.L.,
Photoelectron spectra of some aromatic mono-and di-ketones,
J. Electron Spectrosc. Relat. Phenom., 1979, 17, 81. [all data]
Keller and Halban, 1946
Keller, H.; Halban, H.V.,
Helv. Chim. Acta, 1946, 29, 512. [all data]